{"text_format":"1","workbook":"xlsx","n_sheets":13,"sheets":["Introduction","Chemical Hazards","Reactivity Hazards","Example Scenarios","Source Models","Vapor Dispersions","Explosions","Impact Assessment","Frequency Evaluation","LOPA Form","References","Chemical Table","Revision History"],"not_rendered":{"charts":7,"images":8,"macros":1,"external_links":3,"defined_names":49,"comments":6,"pivot_tables":0},"unopened":[],"bounds":{"document_bytes":16777216,"sheet_cells":100000,"rows_first":2000,"rows_last":500,"rows_between":2000,"halvings":0,"cell_chars":16384,"cell_head_chars":4096},"cells_cut":0,"cells_raw":0,"read":"whole","date_system":"1900"}

{"sheet":"Introduction","index":0,"n_rows":44,"n_cols":3,"rows_kept":44,"cut":false,"hidden":false,"merged":[[39,1,41,9],[42,2,42,3],[1,2,1,8],[2,2,2,8],[3,2,3,8],[4,2,4,8],[6,1,18,9],[20,1,38,9]]}
[]
[null,null,"CHEF Calculation Aid"]
[null,null,"Chemical Hazard Engineering Fundamentals"]
[null,null,"Version 4.5"]
[null,null,{"$f":"\"Latest Revision Date \" & TEXT(MAX('Revision History'!D:D),\"M/DD/YY\")","v":"Latest Revision Date 12/28/25"}]
[]
[null,"Welcome to CHEF 4.5 (Chemical Hazard Engineering Fundamentals).\n\nThe CHEF Calculational Aid was developed through the collaborative efforts of volunteers from member companies of the Center for Chemical Process Safety (CCPS).  This Calculation Aid is intended to support training efforts utilizing the CHEF Guide.  Special appreciation is extended to the Dow Chemical Company for donating CHEF for global use and for providing the resources to help modify this software such that companies can tailor CHEF to meet their company-specific criteria.  It is sincerely hoped that companies using CHEF during their hazard evaluations and risks assessments will be able to improve their process safety performance.   "]
[]
[]
[]
[]
[]
[]
[]
[]
[]
[]
[]
[]
[]
[null,"Disclaimer:\nIt is sincerely hoped that the information presented in this software will lead to an even better safety record for the entire industry; however, neither the American Institute of Chemical Engineers, its consultants, CCPS Technical Steering Committee and Subcommittee members, their employers, their employers officers and directors, nor The Dow Chemical Company, its employees, officers and directors, warrant or represent, expressly or by implication, the correctness or accuracy of the content of the information presented in this software. The default values used in both the RAST and CHEF tools at the time the software was issued were based on engineering judgement, industry guidance, and industry practice.  As between (1) American Institute of Chemical Engineers, its consultants, CCPS Technical Steering Committee and Subcommittee members, their employers, their employer’s officers and directors, and The Dow Chemical Company, its employees, officers and directors, and (2) the user of this software, the user accepts any and all legal liability or responsibility whatsoever for the consequences of its use, misuse, or changes to the software or tools."]
[]
[]
[]
[]
[]
[]
[]
[]
[]
[]
[]
[]
[]
[]
[]
[]
[]
[]
[null,"Please do not distribute this software freely to colleagues, as this software is subject to updates through CCPS.  If you have received this program without participating in CHEF Training, please contact CCPS at ccps@aiche.org for future update communications.  Thank you."]
[]
[]
[null,null,"Copyright © 2026"]
[null,null,"American Institute of Chemical Engineers"]

{"sheet":"Chemical Hazards","index":1,"n_rows":72,"n_cols":33,"rows_kept":72,"cut":false,"hidden":false,"merged":[[30,8,30,12],[58,1,58,2],[57,3,57,6],[44,1,44,2],[43,3,43,7],[43,8,43,12],[33,1,33,2],[34,1,34,2],[35,1,35,2],[36,1,36,2],[53,15,55,21],[27,15,28,21],[29,15,29,21],[44,15,44,16],[45,18,46,20],[8,15,8,16],[9,15,9,16],[40,15,42,21],[15,15,17,21],[10,15,10,16],[11,15,11,16],[12,15,12,16],[31,15,31,16],[7,3,7,4],[0,24,1,24],[6,10,6,12],[7,15,7,16],[3,7,5,12],[2,15,4,21],[1,15,1,21],[20,1,20,2],[21,1,21,2],[22,1,22,2],[23,1,23,2],[32,1,32,2],[24,1,24,2],[8,1,8,2],[9,1,9,2],[10,1,10,2],[11,1,11,2],[12,1,12,2],[57,7,57,10],[45,1,45,2],[46,1,46,2],[47,1,47,2],[49,1,49,2],[48,1,48,2],[59,1,59,2],[60,1,60,2],[61,1,61,2],[62,1,62,2],[63,1,63,2],[18,3,18,7],[30,3,30,7],[18,8,18,11],[63,15,63,16],[19,15,19,16],[20,15,20,16],[21,15,21,16],[22,15,22,16],[46,15,46,16],[47,15,47,16],[48,15,48,16],[49,15,49,16],[58,15,58,16],[59,15,59,16],[60,15,60,16],[61,15,61,16],[62,15,62,16],[45,15,45,16],[66,16,67,20],[57,16,57,20],[8,3,8,4],[9,3,9,4],[10,3,10,4],[11,3,11,4],[12,3,12,4],[32,15,32,16],[33,15,33,16],[34,15,34,16],[35,15,35,16],[36,15,36,16],[23,15,23,16],[24,15,24,16]]}
[null,null,null,null,null,null,null,null,null,null,null,null,null,null,null,null,null,null,null,null,null,null,null,null,"Conversion Factors",null,"Chemical Properties:","A","B","C","D","E"]
[null,null,null,null,null,null,"CHEMICAL HAZARDS AND CHEMICAL MIXTURE INPUT INFORMATION",null,null,null,null,null,null,null,null,"Estimated Mixture Properties as Described in Source Models - Section 12.13",null,null,null,null,null,null,null,null,null,null,"Mol Weight",{"$f":"IF(Chemical_A=\"\",\"\",VLOOKUP(Chemical_A,Chemical_Table,COLUMN('Chemical Table'!C1),FALSE))","v":""},{"$f":"IF(Chemical_B=\"\",\"\",VLOOKUP(Chemical_B,Chemical_Table,COLUMN('Chemical Table'!C1),FALSE))","v":""},{"$f":"IF(Chemical_C=\"\",\"\",VLOOKUP(Chemical_C,Chemical_Table,COLUMN('Chemical Table'!C1),FALSE))","v":""},{"$f":"IF(Chemical_D=\"\",\"\",VLOOKUP(Chemical_D,Chemical_Table,COLUMN('Chemical Table'!C1),FALSE))","v":""},{"$f":"IF(Chemical_E=\"\",\"\",VLOOKUP(Chemical_E,Chemical_Table,COLUMN('Chemical Table'!C1),FALSE))","v":""}]
[null,null,null,null,null,null,"Inputs for one or more chemical components must be entered in shaded \"yellow\" fields if Table Data Value is not used",null,null,null,null,null,null,null,null,"ESTIMATED VAPOR COMPOSITION\nequation 12-19",null,null,null,null,null,null,null,null,{"$f":"IF(E6<>\"\",VLOOKUP(E6,Conversion_Table,2,0),1)","v":1},null,"NFPA Health",{"$f":"IF(Chemical_A=\"\",\"\",VLOOKUP(Chemical_A,Chemical_Table,COLUMN('Chemical Table'!M1),FALSE))","v":""},{"$f":"IF(Chemical_B=\"\",\"\",VLOOKUP(Chemical_B,Chemical_Table,COLUMN('Chemical Table'!M1),FALSE))","v":""},{"$f":"IF(Chemical_C=\"\",\"\",VLOOKUP(Chemical_C,Chemical_Table,COLUMN('Chemical Table'!M1),FALSE))","v":""},{"$f":"IF(Chemical_D=\"\",\"\",VLOOKUP(Chemical_D,Chemical_Table,COLUMN('Chemical Table'!M1),FALSE))","v":""},{"$f":"IF(Chemical_E=\"\",\"\",VLOOKUP(Chemical_E,Chemical_Table,COLUMN('Chemical Table'!M1),FALSE))","v":""}]
["Process Inputs:",null,"Input Value","Input Units",null,null,null,"Note that Weight Fraction, Molecular Weight and Vapor Pressure data, in addition to physical State of Contents, must be entered to estimate Vapor Composition",null,null,null,null,null,null,null,null,null,null,null,null,null,null,null,null,{"$f":"IF(F21<>\"\",VLOOKUP(F21,Conversion_Table,2,0),1)","v":1},null,"NFPA Flammability",{"$f":"IF(Chemical_A=\"\",\"\",VLOOKUP(Chemical_A,Chemical_Table,COLUMN('Chemical Table'!N1),FALSE))","v":""},{"$f":"IF(Chemical_B=\"\",\"\",VLOOKUP(Chemical_B,Chemical_Table,COLUMN('Chemical Table'!N1),FALSE))","v":""},{"$f":"IF(Chemical_C=\"\",\"\",VLOOKUP(Chemical_C,Chemical_Table,COLUMN('Chemical Table'!N1),FALSE))","v":""},{"$f":"IF(Chemical_D=\"\",\"\",VLOOKUP(Chemical_D,Chemical_Table,COLUMN('Chemical Table'!N1),FALSE))","v":""},{"$f":"IF(Chemical_E=\"\",\"\",VLOOKUP(Chemical_E,Chemical_Table,COLUMN('Chemical Table'!N1),FALSE))","v":""}]
[null,"Temperature, T",null,null,{"$f":"IF(D5=\"\",C5,IF(D5=\"F\",ROUND((C5-32)/1.8,1),C5))","v":0},"C",null,null,null,null,null,null,null,null,null,null,null,null,null,null,null,null,null,null,{"$f":"IF(F22<>\"\",VLOOKUP(F22,Conversion_Table,2,0),1)","v":1},null,"NFPA Stability",{"$f":"IF(Chemical_A=\"\",\"\",VLOOKUP(Chemical_A,Chemical_Table,COLUMN('Chemical Table'!O1),FALSE))","v":""},{"$f":"IF(Chemical_B=\"\",\"\",VLOOKUP(Chemical_B,Chemical_Table,COLUMN('Chemical Table'!O1),FALSE))","v":""},{"$f":"IF(Chemical_C=\"\",\"\",VLOOKUP(Chemical_C,Chemical_Table,COLUMN('Chemical Table'!O1),FALSE))","v":""},{"$f":"IF(Chemical_D=\"\",\"\",VLOOKUP(Chemical_D,Chemical_Table,COLUMN('Chemical Table'!O1),FALSE))","v":""},{"$f":"IF(Chemical_E=\"\",\"\",VLOOKUP(Chemical_E,Chemical_Table,COLUMN('Chemical Table'!O1),FALSE))","v":""}]
[null,"Physical State of Contents",null,"Assumed liquid if blank",null,null,null,null,null,null,null,null,null,null,null,null,null,null,{"$f":"\"System Contents are Entered as \"&C6","v":"System Contents are Entered as "},null,null,null,null,null,{"$f":"IF(F23<>\"\",VLOOKUP(F23,Conversion_Table,2,0),1)","v":1},null,"Boiling Pt",{"$f":"IF(Chemical_A=\"\",\"\",VLOOKUP(Chemical_A,Chemical_Table,COLUMN('Chemical Table'!G1),FALSE))","v":""},{"$f":"IF(Chemical_B=\"\",\"\",VLOOKUP(Chemical_B,Chemical_Table,COLUMN('Chemical Table'!G1),FALSE))","v":""},{"$f":"IF(Chemical_C=\"\",\"\",VLOOKUP(Chemical_C,Chemical_Table,COLUMN('Chemical Table'!G1),FALSE))","v":""},{"$f":"IF(Chemical_D=\"\",\"\",VLOOKUP(Chemical_D,Chemical_Table,COLUMN('Chemical Table'!G1),FALSE))","v":""},{"$f":"IF(Chemical_E=\"\",\"\",VLOOKUP(Chemical_E,Chemical_Table,COLUMN('Chemical Table'!G1),FALSE))","v":""},"C"]
[null,null,null,"Estimated Vapor Pressure at Specified Temperature:",{"$f":"T14-101.325","v":-101.325},"kPa gauge",null,null,null,null,"NFPA Hazard Ratings (Table Values)",null,null,null,null,null,null,null,null,null,null,null,null,null,{"$f":"IF(F24<>\"\",VLOOKUP(F24,Conversion_Table,2,0),1)","v":1},null,"Flash Point",{"$f":"IF(Chemical_A=\"\",\"\",VLOOKUP(Chemical_A,Chemical_Table,COLUMN('Chemical Table'!I1),FALSE))","v":""},{"$f":"IF(Chemical_B=\"\",\"\",VLOOKUP(Chemical_B,Chemical_Table,COLUMN('Chemical Table'!I1),FALSE))","v":""},{"$f":"IF(Chemical_C=\"\",\"\",VLOOKUP(Chemical_C,Chemical_Table,COLUMN('Chemical Table'!I1),FALSE))","v":""},{"$f":"IF(Chemical_D=\"\",\"\",VLOOKUP(Chemical_D,Chemical_Table,COLUMN('Chemical Table'!I1),FALSE))","v":""},{"$f":"IF(Chemical_E=\"\",\"\",VLOOKUP(Chemical_E,Chemical_Table,COLUMN('Chemical Table'!I1),FALSE))","v":""},"C"]
["Chemical Inputs:    Table Name",null,null,"Input Name",null,"Wt Fraction","Second Liq Phase","Mol Wt Data Table Value","Mol Wt Input Value","Mol Wt for Equation","Health","Flammability","Stability",null,null,"Chemical Name",null,"Mol Fract Liquid Phase A","Mol Fract Liquid Phase B","Partial Pressure, kPa","Mol Fract Vapor","Wt Fract Vapor",null,null,{"$f":"IF(F25<>\"\",VLOOKUP(F25,Conversion_Table,2,0),1)","v":1},null,"Lower Flammable Limit",{"$f":"IF(Chemical_A=\"\",\"\",VLOOKUP(Chemical_A,Chemical_Table,COLUMN('Chemical Table'!J1),FALSE))","v":""},{"$f":"IF(Chemical_B=\"\",\"\",VLOOKUP(Chemical_B,Chemical_Table,COLUMN('Chemical Table'!J1),FALSE))","v":""},{"$f":"IF(Chemical_C=\"\",\"\",VLOOKUP(Chemical_C,Chemical_Table,COLUMN('Chemical Table'!J1),FALSE))","v":""},{"$f":"IF(Chemical_D=\"\",\"\",VLOOKUP(Chemical_D,Chemical_Table,COLUMN('Chemical Table'!J1),FALSE))","v":""},{"$f":"IF(Chemical_E=\"\",\"\",VLOOKUP(Chemical_E,Chemical_Table,COLUMN('Chemical Table'!J1),FALSE))","v":""},"Vol %"]
[null,null,null,null,null,null,null,{"$f":"AB$2","v":""},null,{"$f":"IF(I9=\"\",H9,I9)","v":""},{"$f":"AB$3","v":""},{"$f":"AB$4","v":""},{"$f":"AB$5","v":""},null,null,{"$f":"IF(B$9=\"\",IF(D$9=\"\",\"\",D$9),B$9)","v":""},null,{"$f":"IF(AG33>0,AB33/AG33,0)","v":0},{"$f":"IF(AG34>0,AB34/AG34,0)","v":0},{"$f":"(R9+S9)*G21","v":0},{"$f":"IF(AND(C6<>\"Vapor\",T$14>0),T9/T$14,IF(AG35>0,AB35/AG35,0))","v":0},{"$f":"IF(AG36>0,AB36/AG36,0)","v":0},null,null,{"$f":"IF(K21<>\"\",VLOOKUP(K21,Conversion_Table,2,0),1)","v":1},null,"ERPG-2",{"$f":"IF(Chemical_A=\"\",\"\",VLOOKUP(Chemical_A,Chemical_Table,COLUMN('Chemical Table'!E1),FALSE))","v":""},{"$f":"IF(Chemical_B=\"\",\"\",VLOOKUP(Chemical_B,Chemical_Table,COLUMN('Chemical Table'!E1),FALSE))","v":""},{"$f":"IF(Chemical_C=\"\",\"\",VLOOKUP(Chemical_C,Chemical_Table,COLUMN('Chemical Table'!E1),FALSE))","v":""},{"$f":"IF(Chemical_D=\"\",\"\",VLOOKUP(Chemical_D,Chemical_Table,COLUMN('Chemical Table'!E1),FALSE))","v":""},{"$f":"IF(Chemical_E=\"\",\"\",VLOOKUP(Chemical_E,Chemical_Table,COLUMN('Chemical Table'!E1),FALSE))","v":""},"ppm"]
[null,null,null,null,null,null,null,{"$f":"AC$2","v":""},null,{"$f":"IF(I10=\"\",H10,I10)","v":""},{"$f":"AC$3","v":""},{"$f":"AC$4","v":""},{"$f":"AC$5","v":""},null,null,{"$f":"IF(B$10=\"\",IF(D$10=\"\",\"\",D$10),B$10)","v":""},null,{"$f":"IF(AG33>0,AC33/AG33,0)","v":0},{"$f":"IF(AG34>0,AC34/AG34,0)","v":0},{"$f":"(R10+S10)*G22","v":0},{"$f":"IF(AND(C6<>\"Vapor\",T$14>0),T10/T$14,IF(AG35>0,AC35/AG35,0))","v":0},{"$f":"IF(AG36>0,AC36/AG36,0)","v":0},null,null,{"$f":"IF(K22<>\"\",VLOOKUP(K22,Conversion_Table,2,0),1)","v":1},null,"ERPG-3",{"$f":"IF(Chemical_A=\"\",\"\",VLOOKUP(Chemical_A,Chemical_Table,COLUMN('Chemical Table'!F1),FALSE))","v":""},{"$f":"IF(Chemical_B=\"\",\"\",VLOOKUP(Chemical_B,Chemical_Table,COLUMN('Chemical Table'!F1),FALSE))","v":""},{"$f":"IF(Chemical_C=\"\",\"\",VLOOKUP(Chemical_C,Chemical_Table,COLUMN('Chemical Table'!F1),FALSE))","v":""},{"$f":"IF(Chemical_D=\"\",\"\",VLOOKUP(Chemical_D,Chemical_Table,COLUMN('Chemical Table'!F1),FALSE))","v":""},{"$f":"IF(Chemical_E=\"\",\"\",VLOOKUP(Chemical_E,Chemical_Table,COLUMN('Chemical Table'!F1),FALSE))","v":""},"ppm"]
[null,null,null,null,null,null,null,{"$f":"AD$2","v":""},null,"",{"$f":"AD$3","v":""},{"$f":"AD$4","v":""},{"$f":"AD$5","v":""},null,null,{"$f":"IF(B$11=\"\",IF(D$11=\"\",\"\",D$11),B$11)","v":""},null,{"$f":"IF(AG33>0,AD33/AG33,0)","v":0},{"$f":"IF(AG34>0,AD34/AG34,0)","v":0},{"$f":"(R11+S11)*G23","v":0},{"$f":"IF(AND(C6<>\"Vapor\",T$14>0),T11/T$14,IF(AG35>0,AD35/AG35,0))","v":0},{"$f":"IF(AG36>0,AD36/AG36,0)","v":0},null,null,{"$f":"IF(K23<>\"\",VLOOKUP(K23,Conversion_Table,2,0),1)","v":1},null,{"$f":"\"Chemical Properties at Temperature of \"&E5&\" C\"","v":"Chemical Properties at Temperature of 0 C"}]
[null,null,null,null,null,null,null,{"$f":"AE$2","v":""},null,"",{"$f":"AE$3","v":""},{"$f":"AE$4","v":""},{"$f":"AE$5","v":""},null,null,{"$f":"IF(B$12=\"\",IF(D$12=\"\",\"\",D$12),B$12)","v":""},null,{"$f":"IF(AG33>0,AE33/AG33,0)","v":0},{"$f":"IF(AG34>0,AE34/AG34,0)","v":0},{"$f":"(R12+S12)*G24","v":0},{"$f":"IF(AND(C6<>\"Vapor\",T$14>0),T12/T$14,IF(AG35>0,AE35/AG35,0))","v":0},{"$f":"IF(AG36>0,AE36/AG36,0)","v":0},null,null,{"$f":"IF(K24<>\"\",VLOOKUP(K24,Conversion_Table,2,0),1)","v":1},null,"Vapor Pressure, Psat",{"$f":"IF(Chemical_A=\"\",0,ROUND(101.325*EXP(AB19-AB20/($E$5+273.15-AB21)),1))","v":0},{"$f":"IF(Chemical_B=\"\",0,ROUND(101.325*EXP(AC19-AC20/($E$5+273.15-AC21)),1))","v":0},{"$f":"IF(Chemical_C=\"\",0,ROUND(101.325*EXP(AD19-AD20/($E$5+273.15-AD21)),1))","v":0},{"$f":"IF(Chemical_D=\"\",0,ROUND(101.325*EXP(AE19-AE20/($E$5+273.15-AE21)),1))","v":0},{"$f":"IF(Chemical_E=\"\",0,ROUND(101.325*EXP(AF19-AF20/($E$5+273.15-AF21)),1))","v":0},"kPa absolute"]
[null,null,null,null,null,null,null,{"$f":"AF$2","v":""},null,"",{"$f":"AF$3","v":""},{"$f":"AF$4","v":""},{"$f":"AF$5","v":""},null,null,{"$f":"IF(B$13=\"\",IF(D$13=\"\",\"\",D$13),B$13)","v":""},null,{"$f":"IF(AG33>0,AF33/AG33,0)","v":0},{"$f":"IF(AG34>0,AF34/AG34,0)","v":0},{"$f":"(R13+S13)*G25","v":0},{"$f":"IF(AND(C6<>\"Vapor\",T$14>0),T13/T$14,IF(AG35>0,AF35/AG35,0))","v":0},{"$f":"IF(AG36>0,AF36/AG36,0)","v":0},null,null,{"$f":"IF(K25<>\"\",VLOOKUP(K25,Conversion_Table,2,0),1)","v":1},null,"Ideal Vapor Density, rV",{"$f":"IF(Chemical_A=\"\",0,ROUND(0.12*(101.3)*AB2/(273.15+$E$5),2))","v":0},{"$f":"IF(Chemical_B=\"\",0,ROUND(0.12*(101.3)*AC2/(273.15+$E$5),2))","v":0},{"$f":"IF(Chemical_C=\"\",0,ROUND(0.12*(101.3)*AD2/(273.15+$E$5),2))","v":0},{"$f":"IF(Chemical_D=\"\",0,ROUND(0.12*(101.3)*AE2/(273.15+$E$5),2))","v":0},{"$f":"IF(Chemical_E=\"\",0,ROUND(0.12*(101.3+$F$6)*AF2/(273.15+$E$5),2))","v":0},"kg/cu m"]
[null,null,null,null,null,{"$f":"SUM(F9:F13)","v":0},{"$f":"IF(F14>1,\"Beware - the sum of weight fractions is great than one\",IF(F14<0.999,\"Beware - the sum of weight fractions is less than one\", \"\"))","v":"Beware - the sum of weight fractions is less than one"},null,null,null,null,null,null,null,null,null,null,null,"Sum of Partial Pressure = ",{"$f":"SUM(T9:T13)","v":0},null,null,null,null,{"$f":"IF(F33<>\"\",VLOOKUP(F33,Conversion_Table,2,0),1)","v":1},null,"Liquid Density, rL",{"$f":"IF(Chemical_A=\"\",0,IF(1000*(AB23-AB24*$E$5)>2*AB13,ROUND(1000*(AB23-AB24*$E$5),1),2*AB13))","v":0},{"$f":"IF(Chemical_B=\"\",0,IF(1000*(AC23-AC24*$E$5)>2*AC13,ROUND(1000*(AC23-AC24*$E$5),1),2*AC13))","v":0},{"$f":"IF(Chemical_C=\"\",0,IF(1000*(AD23-AD24*$E$5)>2*AD13,ROUND(1000*(AD23-AD24*$E$5),1),2*AD13))","v":0},{"$f":"IF(Chemical_D=\"\",0,IF(1000*(AE23-AE24*$E$5)>2*AE13,ROUND(1000*(AE23-AE24*$E$5),1),2*AE13))","v":0},{"$f":"IF(Chemical_E=\"\",0,IF(1000*(AF23-AF24*$E$5)>2*AF13,ROUND(1000*(AF23-AF24*$E$5),1),2*AF13))","v":0},"kg/cu m"]
[null,null,null,null,null,null,null,null,null,null,null,null,null,null,null,null,null,null,null,null,null,null,null,null,{"$f":"IF(F34<>\"\",VLOOKUP(F34,Conversion_Table,2,0),1)","v":1},null,"Liquid Heat Capacity, CS",{"$f":"IF(Chemical_A=\"\",0,ROUND(4.1868*(AB26+AB27*$E$5),3))","v":0},{"$f":"IF(Chemical_B=\"\",0,ROUND(4.1868*(AC26+AC27*$E$5),3))","v":0},{"$f":"IF(Chemical_C=\"\",0,ROUND(4.1868*(AD26+AD27*$E$5),3))","v":0},{"$f":"IF(Chemical_D=\"\",0,ROUND(4.1868*(AE26+AE27*$E$5),3))","v":0},{"$f":"IF(Chemical_E=\"\",0,ROUND(4.1868*(AF26+AF27*$E$5),3))","v":0},"kJ/kg C"]
[null,null,null,null,null,null,null,null,null,null,null,null,null,null,null,"ESTIMATED MIXTURE LIQUID DENSITY and VAPOR MOLECULAR WEIGHT\nequation 12-20 and equation 12-21",null,null,null,null,null,null,null,null,{"$f":"IF(F35<>\"\",VLOOKUP(F35,Conversion_Table,2,0),1)","v":1},null,"Vapor Heat Capacity, CS",{"$f":"IF(Chemical_A=\"\",0,ROUND(4.1868*(AB26-AB30+(AB27-2*AB31)*$E$5),3))","v":0},{"$f":"IF(Chemical_B=\"\",0,ROUND(4.1868*(AC26-AC30+(AC27-2*AC31)*$E$5),3))","v":0},{"$f":"IF(Chemical_C=\"\",0,ROUND(4.1868*(AD26-AD30+(AD27-2*AD31)*$E$5),3))","v":0},{"$f":"IF(Chemical_D=\"\",0,ROUND(4.1868*(AE26-AE30+(AE27-2*AE31)*$E$5),3))","v":0},{"$f":"IF(Chemical_E=\"\",0,ROUND(4.1868*(AF26-AF30+(AF27-2*AF31)*$E$5),3))","v":0},"kJ/kg C"]
[null,null,null,null,null,null,null,null,null,null,null,null,null,null,null,null,null,null,null,null,null,null,null,null,{"$f":"IF(F36<>\"\",VLOOKUP(F36,Conversion_Table,2,0),1)","v":1},null,"Heat of Vaporization, DHV",{"$f":"IF(Chemical_A=\"\",0,IF(4.1868*(AB29-AB30*$E$5-AB31*$E$5^2)>50,ROUND(4.1868*(AB29-AB30*$E$5-AB31*$E$5^2),1),50))","v":0},{"$f":"IF(Chemical_B=\"\",0,IF(4.1868*(AC29-AC30*$E$5-AC31*$E$5^2)>50,ROUND(4.1868*(AC29-AC30*$E$5-AC31*$E$5^2),1),50))","v":0},{"$f":"IF(Chemical_C=\"\",0,IF(4.1868*(AD29-AD30*$E$5-AD31*$E$5^2)>50,ROUND(4.1868*(AD29-AD30*$E$5-AD31*$E$5^2),1),50))","v":0},{"$f":"IF(Chemical_D=\"\",0,IF(4.1868*(AE29-AE30*$E$5-AE31*$E$5^2)>50,ROUND(4.1868*(AE29-AE30*$E$5-AE31*$E$5^2),1),50))","v":0},{"$f":"IF(Chemical_E=\"\",0,IF(4.1868*(AF29-AF30*$E$5-AF31*$E$5^2)>50,ROUND(4.1868*(AF29-AF30*$E$5-AF31*$E$5^2),1),50))","v":0},"kJ/kg"]
["Physical Property Inputs:",null,null,null,null,null,null,null,null,null,null,null,null,null,null,null,null,null,null,null,null,null,null,null,{"$f":"IF(F37<>\"\",VLOOKUP(F37,Conversion_Table,2,0),1)","v":1}]
[null,null,null,"Vapor Pressure at Input Temperature",null,null,null,null,"Liquid Density at Input Temperature",null,null,null,null,null,null,null,null,null,null,null,null,null,null,null,{"$f":"IF(K33<>\"\",VLOOKUP(K33,Conversion_Table,2,0),1)","v":1},null,"Vapor Pressure A",{"$f":"VLOOKUP(Chemical_A,Chemical_Table,COLUMN('Chemical Table'!$AE$1),FALSE)","v":{"$error":"#N/A"}},{"$f":"VLOOKUP(Chemical_B,Chemical_Table,COLUMN('Chemical Table'!$AE$1),FALSE)","v":{"$error":"#N/A"}},{"$f":"VLOOKUP(Chemical_C,Chemical_Table,COLUMN('Chemical Table'!$AE$1),FALSE)","v":{"$error":"#N/A"}},{"$f":"VLOOKUP(Chemical_D,Chemical_Table,COLUMN('Chemical Table'!$AE$1),FALSE)","v":{"$error":"#N/A"}},{"$f":"VLOOKUP(Chemical_E,Chemical_Table,COLUMN('Chemical Table'!$AE$1),FALSE)","v":{"$error":"#N/A"}}]
[null,null,null,"Data Table Value","Input Value","Input Units","Equation Input"," Equation Units","Data Table Value","Input Value","Input Units","Equation Input"," Equation Units",null,null,"Chemical Name",null,"Wt Fraction / Density",null,null,null,"Mw * Mole Fract Vapor",null,null,{"$f":"IF(K34<>\"\",VLOOKUP(K34,Conversion_Table,2,0),1)","v":1},null,"Vapor Pressure B",{"$f":"VLOOKUP(Chemical_A,Chemical_Table,COLUMN('Chemical Table'!$AF$1),FALSE)","v":{"$error":"#N/A"}},{"$f":"VLOOKUP(Chemical_B,Chemical_Table,COLUMN('Chemical Table'!$AF$1),FALSE)","v":{"$error":"#N/A"}},{"$f":"VLOOKUP(Chemical_C,Chemical_Table,COLUMN('Chemical Table'!$AF$1),FALSE)","v":{"$error":"#N/A"}},{"$f":"VLOOKUP(Chemical_D,Chemical_Table,COLUMN('Chemical Table'!$AF$1),FALSE)","v":{"$error":"#N/A"}},{"$f":"VLOOKUP(Chemical_E,Chemical_Table,COLUMN('Chemical Table'!$AF$1),FALSE)","v":{"$error":"#N/A"}}]
[null,{"$f":"IF(B$9=\"\",IF(D$9=\"\",\"\",D$9),B$9)","v":""},null,{"$f":"AB$12","v":0},null,null,{"$f":"IF(E21=\"\",D21,E21*Y4)","v":0}," kPa",{"$f":"AB$14","v":0},null,null,{"$f":"IF(J21=\"\",I21,J21*Y9)","v":0},"kg/cu m",null,null,{"$f":"IF(B$9=\"\",IF(D$9=\"\",\"\",D$9),B$9)","v":""},null,{"$f":"IF(L21>0,F9/L21,0)","v":0},null,null,null,{"$f":"IF(J9<>\"\",U9*J9,0)","v":0},null,null,{"$f":"IF(K35<>\"\",VLOOKUP(K35,Conversion_Table,2,0),1)","v":1},null,"Vapor Pressure C",{"$f":"VLOOKUP(Chemical_A,Chemical_Table,COLUMN('Chemical Table'!$AG$1),FALSE)","v":{"$error":"#N/A"}},{"$f":"VLOOKUP(Chemical_B,Chemical_Table,COLUMN('Chemical Table'!$AG$1),FALSE)","v":{"$error":"#N/A"}},{"$f":"VLOOKUP(Chemical_C,Chemical_Table,COLUMN('Chemical Table'!$AG$1),FALSE)","v":{"$error":"#N/A"}},{"$f":"VLOOKUP(Chemical_D,Chemical_Table,COLUMN('Chemical Table'!$AG$1),FALSE)","v":{"$error":"#N/A"}},{"$f":"VLOOKUP(Chemical_E,Chemical_Table,COLUMN('Chemical Table'!$AG$1),FALSE)","v":{"$error":"#N/A"}}]
[null,{"$f":"IF(B$10=\"\",IF(D$10=\"\",\"\",D$10),B$10)","v":""},null,{"$f":"AC$12","v":0},null,null,{"$f":"IF(E22=\"\",D22,E22*Y5)","v":0}," kPa",{"$f":"AC$14","v":0},null,null,{"$f":"IF(J22=\"\",I22,J22*Y10)","v":0},"kg/cu m",null,null,{"$f":"IF(B$10=\"\",IF(D$10=\"\",\"\",D$10),B$10)","v":""},null,{"$f":"IF(L22>0,F10/L22,0)","v":0},null,null,null,{"$f":"IF(J10<>\"\",U10*J10,0)","v":0},null,null,{"$f":"IF(K36<>\"\",VLOOKUP(K36,Conversion_Table,2,0),1)","v":1}]
[null,{"$f":"IF(B$11=\"\",IF(D$11=\"\",\"\",D$11),B$11)","v":""},null,{"$f":"AD$12","v":0},null,null,{"$f":"IF(E23=\"\",D23,E23*Y6)","v":0}," kPa",{"$f":"AD$14","v":0},null,null,{"$f":"IF(J23=\"\",I23,J23*Y11)","v":0},"kg/cu m",null,null,{"$f":"IF(B$11=\"\",IF(D$11=\"\",\"\",D$11),B$11)","v":""},null,{"$f":"IF(L23>0,F11/L23,0)","v":0},null,null,null,{"$f":"IF(J11<>\"\",U11*J11,0)","v":0},null,null,{"$f":"IF(K37<>\"\",VLOOKUP(K37,Conversion_Table,2,0),1)","v":1},null,"Liquid Density A",{"$f":"VLOOKUP(Chemical_A,Chemical_Table,COLUMN('Chemical Table'!$X$1),FALSE)","v":{"$error":"#N/A"}},{"$f":"VLOOKUP(Chemical_B,Chemical_Table,COLUMN('Chemical Table'!$X$1),FALSE)","v":{"$error":"#N/A"}},{"$f":"VLOOKUP(Chemical_C,Chemical_Table,COLUMN('Chemical Table'!$X$1),FALSE)","v":{"$error":"#N/A"}},{"$f":"VLOOKUP(Chemical_D,Chemical_Table,COLUMN('Chemical Table'!$X$1),FALSE)","v":{"$error":"#N/A"}},{"$f":"VLOOKUP(Chemical_E,Chemical_Table,COLUMN('Chemical Table'!$X$1),FALSE)","v":{"$error":"#N/A"}}]
[null,{"$f":"IF(B$12=\"\",IF(D$12=\"\",\"\",D$12),B$12)","v":""},null,{"$f":"AE$12","v":0},null,null,{"$f":"IF(E24=\"\",D24,E24*Y7)","v":0}," kPa",{"$f":"AE$14","v":0},null,null,{"$f":"IF(J24=\"\",I24,J24*Y12)","v":0},"kg/cu m",null,null,{"$f":"IF(B$12=\"\",IF(D$12=\"\",\"\",D$12),B$12)","v":""},null,{"$f":"IF(L24>0,F12/L24,0)","v":0},null,null,null,{"$f":"IF(J12<>\"\",U12*J12,0)","v":0},null,null,{"$f":"IF(D56<>\"\",VLOOKUP(D56,Conversion_Table,2,0),1)","v":1},null,"Liquid Density B",{"$f":"VLOOKUP(Chemical_A,Chemical_Table,COLUMN('Chemical Table'!$Y$1),FALSE)","v":{"$error":"#N/A"}},{"$f":"VLOOKUP(Chemical_B,Chemical_Table,COLUMN('Chemical Table'!$Y$1),FALSE)","v":{"$error":"#N/A"}},{"$f":"VLOOKUP(Chemical_C,Chemical_Table,COLUMN('Chemical Table'!$Y$1),FALSE)","v":{"$error":"#N/A"}},{"$f":"VLOOKUP(Chemical_D,Chemical_Table,COLUMN('Chemical Table'!$Y$1),FALSE)","v":{"$error":"#N/A"}},{"$f":"VLOOKUP(Chemical_E,Chemical_Table,COLUMN('Chemical Table'!$Y$1),FALSE)","v":{"$error":"#N/A"}}]
[null,{"$f":"IF(B$13=\"\",IF(D$13=\"\",\"\",D$13),B$13)","v":""},null,{"$f":"AF$12","v":0},null,null,{"$f":"IF(E25=\"\",D25,E25*Y8)","v":0}," kPa",{"$f":"AF$14","v":0},null,null,{"$f":"IF(J25=\"\",I25,J25*Y13)","v":0},"kg/cu m",null,null,{"$f":"IF(B$13=\"\",IF(D$13=\"\",\"\",D$13),B$13)","v":""},null,{"$f":"IF(L25>0,F13/L25,0)","v":0},null,null,null,{"$f":"IF(J13<>\"\",U13*J13,0)","v":0},null,null,{"$f":"IF('Reactivity Hazards'!E12<>\"\",VLOOKUP('Reactivity Hazards'!E12,Conversion_Table,2,0),1)","v":1}]
[null,null,null,null,null,null,null,null,null,null,null,null,null,null,null,null,"Liquid rMixture = 1 / S (xi / rLi) = ",{"$f":"IF(SUM(R21:R25)>0,1/SUM(R21:R25),0)","v":0},"kg/cu m",null,"Vapor Mw = S yi * Mwi =",{"$f":"SUM(V21:V25)","v":0},null,null,{"$f":"IF('Reactivity Hazards'!E13<>\"\",VLOOKUP('Reactivity Hazards'!E13,Conversion_Table,2,0),1)","v":1},null,"Liquid Heat Capacity A",{"$f":"VLOOKUP(Chemical_A,Chemical_Table,COLUMN('Chemical Table'!$Z$1),FALSE)","v":{"$error":"#N/A"}},{"$f":"VLOOKUP(Chemical_B,Chemical_Table,COLUMN('Chemical Table'!$Z$1),FALSE)","v":{"$error":"#N/A"}},{"$f":"VLOOKUP(Chemical_C,Chemical_Table,COLUMN('Chemical Table'!$Z$1),FALSE)","v":{"$error":"#N/A"}},{"$f":"VLOOKUP(Chemical_D,Chemical_Table,COLUMN('Chemical Table'!$Z$1),FALSE)","v":{"$error":"#N/A"}},{"$f":"VLOOKUP(Chemical_E,Chemical_Table,COLUMN('Chemical Table'!$Z$1),FALSE)","v":{"$error":"#N/A"}}]
[null,null,null,null,null,null,null,null,null,null,null,null,null,null,null,null,null,null,null,null,null,null,null,null,{"$f":"IF('Reactivity Hazards'!E15>\"\",VLOOKUP('Reactivity Hazards'!E15,Conversion_Table,2,0),1)","v":1},null,"Liquid Heat Capacity B",{"$f":"VLOOKUP(Chemical_A,Chemical_Table,COLUMN('Chemical Table'!$AA$1),FALSE)","v":{"$error":"#N/A"}},{"$f":"VLOOKUP(Chemical_B,Chemical_Table,COLUMN('Chemical Table'!$AA$1),FALSE)","v":{"$error":"#N/A"}},{"$f":"VLOOKUP(Chemical_C,Chemical_Table,COLUMN('Chemical Table'!$AA$1),FALSE)","v":{"$error":"#N/A"}},{"$f":"VLOOKUP(Chemical_D,Chemical_Table,COLUMN('Chemical Table'!$AA$1),FALSE)","v":{"$error":"#N/A"}},{"$f":"VLOOKUP(Chemical_E,Chemical_Table,COLUMN('Chemical Table'!$AA$1),FALSE)","v":{"$error":"#N/A"}}]
[null,null,null,null,null,null,null,null,null,null,null,null,null,null,null,{"$f":"\"ESTIMATED MIXTURE \"&IF(C6=\"Vapor\",\"VAPOR \",\"LIQUID \")&\"HEAT CAPACITY and HEAT OF VAPORIZATION\"","v":"ESTIMATED MIXTURE LIQUID HEAT CAPACITY and HEAT OF VAPORIZATION"},null,null,null,null,null,null,null,null,{"$f":"IF('Reactivity Hazards'!E14>\"\",VLOOKUP('Reactivity Hazards'!E14,Conversion_Table,2,0),1)","v":1}]
[null,null,null,null,null,null,null,null,null,null,null,null,null,null,null,null,null,null,null,null,null,null,null,null,{"$f":"IF('Reactivity Hazards'!E35<>\"\",VLOOKUP('Reactivity Hazards'!E35,Conversion_Table,2,0),1)","v":1},null,"Heat of Vaporization A",{"$f":"VLOOKUP(Chemical_A,Chemical_Table,COLUMN('Chemical Table'!$AB$1),FALSE)","v":{"$error":"#N/A"}},{"$f":"VLOOKUP(Chemical_B,Chemical_Table,COLUMN('Chemical Table'!$AB$1),FALSE)","v":{"$error":"#N/A"}},{"$f":"VLOOKUP(Chemical_C,Chemical_Table,COLUMN('Chemical Table'!$AB$1),FALSE)","v":{"$error":"#N/A"}},{"$f":"VLOOKUP(Chemical_D,Chemical_Table,COLUMN('Chemical Table'!$AB$1),FALSE)","v":{"$error":"#N/A"}},{"$f":"VLOOKUP(Chemical_E,Chemical_Table,COLUMN('Chemical Table'!$AB$1),FALSE)","v":{"$error":"#N/A"}}]
[null,null,null,null,null,null,null,null,null,null,null,null,null,null,null,"equation 12-22 and equation 12-23",null,null,null,null,null,null,null,null,{"$f":"IF('Reactivity Hazards'!E36<>\"\",VLOOKUP('Reactivity Hazards'!E36,Conversion_Table,2,0),1)","v":1},null,"Heat of Vaporization B",{"$f":"VLOOKUP(Chemical_A,Chemical_Table,COLUMN('Chemical Table'!$AC$1),FALSE)","v":{"$error":"#N/A"}},{"$f":"VLOOKUP(Chemical_B,Chemical_Table,COLUMN('Chemical Table'!$AC$1),FALSE)","v":{"$error":"#N/A"}},{"$f":"VLOOKUP(Chemical_C,Chemical_Table,COLUMN('Chemical Table'!$AC$1),FALSE)","v":{"$error":"#N/A"}},{"$f":"VLOOKUP(Chemical_D,Chemical_Table,COLUMN('Chemical Table'!$AC$1),FALSE)","v":{"$error":"#N/A"}},{"$f":"VLOOKUP(Chemical_E,Chemical_Table,COLUMN('Chemical Table'!$AC$1),FALSE)","v":{"$error":"#N/A"}}]
[null,null,null,{"$f":"IF(C$6=\"Vapor\",\"Vapor \",\"Liquid \")&\"Heat Capacity at Input Temperature\"","v":"Liquid Heat Capacity at Input Temperature"},null,null,null,null,"Heat of Vaporization at Input Temperature",null,null,null,null,null,null,null,null,null,null,null,null,null,null,null,null,null,"Heat of Vaporization C",{"$f":"VLOOKUP(Chemical_A,Chemical_Table,COLUMN('Chemical Table'!$AD$1),FALSE)","v":{"$error":"#N/A"}},{"$f":"VLOOKUP(Chemical_B,Chemical_Table,COLUMN('Chemical Table'!$AD$1),FALSE)","v":{"$error":"#N/A"}},{"$f":"VLOOKUP(Chemical_C,Chemical_Table,COLUMN('Chemical Table'!$AD$1),FALSE)","v":{"$error":"#N/A"}},{"$f":"VLOOKUP(Chemical_D,Chemical_Table,COLUMN('Chemical Table'!$AD$1),FALSE)","v":{"$error":"#N/A"}},{"$f":"VLOOKUP(Chemical_E,Chemical_Table,COLUMN('Chemical Table'!$AD$1),FALSE)","v":{"$error":"#N/A"}}]
[null,null,null,"Data Table Value","Input Value","Input Units","Equation Input"," Equation Units","Data Table Value","Input Value","Input Units","Equation Input"," Equation Units",null,null,"Chemical Name",null,"Wt Fraction * Heat Capacity",null,null,"Wt Fraction * Heat of Vaporize",null,null,null,null,null,null,null,null,null,null,null,"Sum"]
[null,{"$f":"IF(B$9=\"\",IF(D$9=\"\",\"\",D$9),B$9)","v":""},null,{"$f":"IF(C$6=\"Vapor\",AB$16,AB$15)","v":0},null,null,{"$f":"IF(E33=\"\",D33,E33*Y14)","v":0},"kJ/kg C",{"$f":"AB$17","v":0},null,null,{"$f":"IF(J33=\"\",I33,J33*Y19)","v":0},"kJ/kg",null,null,{"$f":"IF(B$9=\"\",IF(D$9=\"\",\"\",D$9),B$9)","v":""},null,{"$f":"F9*G33","v":0},null,null,{"$f":"V9*L33","v":0},null,null,null,null,null,"Liquid Phase A",{"$f":"IF(J9=\"\",0,IF(AND(J9>0,G9<>\"Yes\"),F9/J9,0))","v":0},{"$f":"IF(J10=\"\",0,IF(AND(J10>0,G10<>\"Yes\"),F10/J10,0))","v":0},{"$f":"IF(J11=\"\",0,IF(AND(J11>0,G11<>\"Yes\"),F11/J11,0))","v":0},{"$f":"IF(J12=\"\",0,IF(AND(J12>0,G12<>\"Yes\"),F12/J12,0))","v":0},{"$f":"IF(J13=\"\",0,IF(AND(J13>0,G13<>\"Yes\"),F13/J13,0))","v":0},{"$f":"SUM(AB33:AF33)","v":0}]
[null,{"$f":"IF(B$10=\"\",IF(D$10=\"\",\"\",D$10),B$10)","v":""},null,{"$f":"IF(C$6=\"Vapor\",AC$16,AC$15)","v":0},null,null,{"$f":"IF(E34=\"\",D34,E34*Y15)","v":0},"kJ/kg C",{"$f":"AC$17","v":0},null,null,{"$f":"IF(J34=\"\",I34,J34*Y20)","v":0},"kJ/kg",null,null,{"$f":"IF(B$10=\"\",IF(D$10=\"\",\"\",D$10),B$10)","v":""},null,{"$f":"F10*G34","v":0},null,null,{"$f":"V10*L34","v":0},null,null,null,null,null,"Liquid Phase B",{"$f":"IF(J9=\"\",0,IF(AND(J9>0,G9=\"Yes\"),F9/J9,0))","v":0},{"$f":"IF(J10=\"\",0,IF(AND(J10>0,G10=\"Yes\"),F10/J10,0))","v":0},{"$f":"IF(J11=\"\",0,IF(AND(J11>0,G11=\"Yes\"),F11/J11,0))","v":0},{"$f":"IF(J12=\"\",0,IF(AND(J12>0,G12=\"Yes\"),F12/J12,0))","v":0},{"$f":"IF(J13=\"\",0,IF(AND(J13>0,G13=\"Yes\"),F13/J13,0))","v":0},{"$f":"SUM(AB34:AF34)","v":0}]
[null,{"$f":"IF(B$11=\"\",IF(D$11=\"\",\"\",D$11),B$11)","v":""},null,{"$f":"IF(C$6=\"Vapor\",AD$16,AD$15)","v":0},null,null,{"$f":"IF(E35=\"\",D35,E35*Y16)","v":0},"kJ/kg C",{"$f":"AD$17","v":0},null,null,{"$f":"IF(J35=\"\",I35,J35*Y21)","v":0},"kJ/kg",null,null,{"$f":"IF(B$11=\"\",IF(D$11=\"\",\"\",D$11),B$11)","v":""},null,{"$f":"F11*G35","v":0},null,null,{"$f":"V11*L35","v":0},null,null,null,null,null,"Overall ",{"$f":"SUM(AB33:AB34)","v":0},{"$f":"SUM(AC33:AC34)","v":0},0,0,0,{"$f":"SUM(AG33:AG34)","v":0}]
[null,{"$f":"IF(B$12=\"\",IF(D$12=\"\",\"\",D$12),B$12)","v":""},null,{"$f":"IF(C$6=\"Vapor\",AE$16,AE$15)","v":0},null,null,{"$f":"IF(E36=\"\",D36,E36*Y17)","v":0},"kJ/kg C",{"$f":"AE$17","v":0},null,null,{"$f":"IF(J36=\"\",I36,J36*Y22)","v":0},"kJ/kg",null,null,{"$f":"IF(B$12=\"\",IF(D$12=\"\",\"\",D$12),B$12)","v":""},null,{"$f":"F12*G36","v":0},null,null,{"$f":"V12*L36","v":0},null,null,null,null,null,"Vapor Mol Fract * Mole Wt.",{"$f":"IF(J9=\"\",0,U9*J9)","v":0},{"$f":"IF(J10=\"\",0,U10*J10)","v":0},{"$f":"IF(J11=\"\",0,U11*J11)","v":0},{"$f":"IF(J12=\"\",0,U12*J12)","v":0},{"$f":"IF(J13=\"\",0,U13*J13)","v":0},{"$f":"SUM(AB36:AF36)","v":0}]
[null,{"$f":"IF(B$13=\"\",IF(D$13=\"\",\"\",D$13),B$13)","v":""},null,{"$f":"IF(C$6=\"Vapor\",AF$16,AF$15)","v":0},null,null,{"$f":"IF(E37=\"\",D37,E37*Y18)","v":0},"kJ/kg C",{"$f":"AF$17","v":0},null,null,{"$f":"IF(J37=\"\",I37,J37*Y23)","v":0},"kJ/kg",null,null,{"$f":"IF(B$13=\"\",IF(D$13=\"\",\"\",D$13),B$13)","v":""},null,{"$f":"F13*G37","v":0},null,null,{"$f":"V13*L37","v":0}]
[null,null,null,null,null,null,null,null,null,null,null,null,null,null,null,null,"Liquid CMixture =  S (x'i * CLi) = ",{"$f":"SUM(R33:R37)","v":0},"kJ/kg C"]
[null,null,null,null,null,null,null,null,null,null,null,null,null,null,null,null,null,null,null,"Ht of VaporizeMixture =  S (y'i * DHvi) = ",{"$f":"SUM(U33:U37)","v":0},"kJ/kg"]
[]
[null,null,null,null,null,null,null,null,null,null,null,null,null,null,null,"ESTIMATED MIXTURE LFL and MINIMUM FLASH POINT\nequation 3-1"]
["Flammability Property Inputs:"]
[]
[null,null,null,"Flash Point (Liquid)",null,null,null,null,"Lower Flammable Limit"]
[null,"Chemical Name",null,"Data Table Value","Input Value","Input Units","Equation Input"," Equation Units","Data Table Value","Input Value","Input Units","Equation Input"," Equation Units",null,null,"Chemical Name",null,"Mol Fract Vapor / LFL"]
[null,{"$f":"IF(B$9=\"\",IF(D$9=\"\",\"\",D$9),B$9)","v":""},null,{"$f":"IF(AND(AB$7=0,AB$8=0),\"\",AB$7)","v":""},null,null,{"$f":"IF(E46=\"\",D46,IF(F46=\"F\",ROUND((E46-32)/1.8,1),E46))","v":""},"C",{"$f":"IF(AND(AB$7=0,AB$8=0),\"\",AB$8)","v":""},null,null,{"$f":"IF(J46=\"\",I46,IF(AND(K46=\"mg/cu m\",J9=0),0,IF(K46=\"mg/cu m\",ROUND(J46*0.002445/J9,2),IF(K46=\"ppm\",J46/10000,J46))))","v":""},"vol %",null,null,{"$f":"IF(B$9=\"\",IF(D$9=\"\",\"\",D$9),B$9)","v":""},null,{"$f":"IF(L46=\"\",0,IF(L46>0,U9/L46,0))","v":0},"The Minimum Flash Point for any Component is:"]
[null,{"$f":"IF(B$10=\"\",IF(D$10=\"\",\"\",D$10),B$10)","v":""},null,{"$f":"IF(AND(AC$7=0,AC$8=0),\"\",AC$7)","v":""},null,null,{"$f":"IF(E47=\"\",D47,IF(F47=\"F\",ROUND((E47-32)/1.8,1),E47))","v":""},"C",{"$f":"IF(AND(AC$7=0,AC$8=0),\"\",AC$8)","v":""},null,null,{"$f":"IF(J47=\"\",I47,IF(AND(K47=\"mg/cu m\",J10=0),0,IF(K47=\"mg/cu m\",ROUND(J47*0.002445/J10,2),IF(K47=\"ppm\",J47/10000,J47))))","v":""},"vol %",null,null,{"$f":"IF(B$10=\"\",IF(D$10=\"\",\"\",D$10),B$10)","v":""},null,{"$f":"IF(L47=\"\",0,IF(L47>0,U10/L47,0))","v":0}]
[null,{"$f":"IF(B$11=\"\",IF(D$11=\"\",\"\",D$11),B$11)","v":""},null,{"$f":"IF(AND(AD$7=0,AD$8=0),\"\",AD$7)","v":""},null,null,"","C",{"$f":"IF(AND(AD$7=0,AD$8=0),\"\",AD$8)","v":""},null,null,{"$f":"IF(J48=\"\",I48,IF(AND(K48=\"mg/cu m\",J11=0),0,IF(K48=\"mg/cu m\",ROUND(J48*0.002445/J11,2),IF(K48=\"ppm\",J48/10000,J48))))","v":""},"vol %",null,null,{"$f":"IF(B$11=\"\",IF(D$11=\"\",\"\",D$11),B$11)","v":""},null,{"$f":"IF(L48=\"\",0,IF(L48>0,U11/L48,0))","v":0},null,{"$f":"MIN(G46:G50)","v":0},"C"]
[null,{"$f":"IF(B$12=\"\",IF(D$12=\"\",\"\",D$12),B$12)","v":""},null,{"$f":"IF(AND(AE$7=0,AE$8=0),\"\",AE$7)","v":""},null,null,"","C",{"$f":"IF(AND(AE$7=0,AE$8=0),\"\",AE$8)","v":""},null,null,{"$f":"IF(J49=\"\",I49,IF(AND(K49=\"mg/cu m\",J12=0),0,IF(K49=\"mg/cu m\",ROUND(J49*0.002445/J12,2),IF(K49=\"ppm\",J49/10000,J49))))","v":""},"vol %",null,null,{"$f":"IF(B$12=\"\",IF(D$12=\"\",\"\",D$12),B$12)","v":""},null,{"$f":"IF(L49=\"\",0,IF(L49>0,U12/L49,0))","v":0}]
[null,{"$f":"IF(B$13=\"\",IF(D$13=\"\",\"\",D$13),B$13)","v":""},null,{"$f":"IF(AND(AF$7=0,AF$8=0),\"\",AF$7)","v":""},null,null,"","C",{"$f":"IF(AND(AF$7=0,AF$8=0),\"\",AF$8)","v":""},null,null,{"$f":"IF(J50=\"\",I50,IF(AND(K50=\"mg/cu m\",J10=0),0,IF(K50=\"mg/cu m\",ROUND(J50*0.002445/J13,2),IF(K50=\"ppm\",J50/10000,J50))))","v":""},"vol %",null,null,{"$f":"IF(B$13=\"\",IF(D$13=\"\",\"\",D$13),B$13)","v":""},null,{"$f":"IF(L50=\"\",0,IF(L50>0,U13/L50,0))","v":0}]
[null,null,null,null,null,null,null,null,null,null,null,null,null,null,null,null,"S yi / LFLi =",{"$f":"SUM(R46:R50)","v":0}]
[null,null,null,null,null,null,null,null,null,null,null,null,null,null,null,null,"LFLMixture = 1 / (S yi / LFLi) = ",{"$f":"IF(R51>0,1/R51,\"\")","v":""},"Vol %"]
[]
[null,null,null,null,null,null,null,null,null,null,null,null,null,null,null,"ESTIMATED MIXTURE ERPG-2 and ERPG-3\nDose adjusted ERPG per equation 4-1 and mixture ERPG per equation 4-3"]
["Toxicity Property Inputs:",null,"Input Value","Input Units","Equation Input"," Equation Units"]
[null,"Exposure Duration, t",null,null,{"$f":"IF(C56=\"\",60,C56*Y24)","v":60},"min"]
[]
[null,null,null,"One-Hour ERPG-2",null,null,null,"One-Hour ERPG-3",null,null,null,null,null,null,null,null,{"$f":"\"Based on Exposure Duration of  \"&ROUND(E56,1)&\" min\"","v":"Based on Exposure Duration of  60 min"}]
[null,"ERPG-2",null,"Data Table Value","Input Value","Input Units","Equation Input","Data Table Value","Input Value","Input Units","Equation Input"," Equation Units","Dose Exponent, n",null,null,"Chemical Name",null,"ERPG-2 (t /60)1/n","Mol Fract Vapor / ERPG-2 (t /60)1/n",null,"ERPG-3 (t /60)1/n","Mol Fract Vapor / ERPG-3 (t /60)1/n"]
[null,{"$f":"IF(B$9=\"\",IF(D$9=\"\",\"\",D$9),B$9)","v":""},null,{"$f":"AB$9","v":""},null,null,{"$f":"IF(E60=\"\",D60,IF(AND(F60=\"mg/cu m\",J9=0),0,IF(F60=\"mg/cu m\",ROUND(E60*24.45/J9,2),IF(F60=\"vol %\",E60*10000,E60))))","v":""},{"$f":"AB$10","v":""},null,null,{"$f":"IF(I60=\"\",H60,IF(AND(J60=\"mg/cu m\",J9=0),0,IF(J60=\"mg/cu m\",ROUND(I60*24.45/J9,2),IF(J60=\"vol %\",I60*10000,I60))))","v":""},"ppm",null,null,null,{"$f":"IF(B$9=\"\",IF(D$9=\"\",\"\",D$9),B$9)","v":""},null,{"$f":"IF(G60=\"\",0,G60*(60/E$56)^IF(M60<>\"\",1/M60,IF(E$56>60,1,0.5)))","v":0},{"$f":"IF(R60>0,U9/R60,0)","v":0},null,{"$f":"IF(K60=\"\",0,K60*(60/E$56)^IF(M60<>\"\",1/M60,IF(E$56>60,1,0.5)))","v":0},{"$f":"IF(U60>0,U9/U60,0)","v":0}]
[null,{"$f":"IF(B$10=\"\",IF(D$10=\"\",\"\",D$10),B$10)","v":""},null,{"$f":"AC$9","v":""},null,null,{"$f":"IF(E61=\"\",D61,IF(AND(F61=\"mg/cu m\",J10=0),0,IF(F61=\"mg/cu m\",ROUND(E61*24.45/J10,2),IF(F61=\"vol %\",E61*10000,E61))))","v":""},{"$f":"AC$10","v":""},null,null,{"$f":"IF(I61=\"\",H61,IF(AND(J61=\"mg/cu m\",J10=0),0,IF(J61=\"mg/cu m\",ROUND(I61*24.45/J10,2),IF(J61=\"vol %\",I61*10000,I61))))","v":""},"ppm",null,null,null,{"$f":"IF(B$10=\"\",IF(D$10=\"\",\"\",D$10),B$10)","v":""},null,{"$f":"IF(G61=\"\",0,G61*(60/E$56)^IF(M61<>\"\",1/M61,IF(E$56>60,1,0.5)))","v":0},{"$f":"IF(R61>0,U10/R61,0)","v":0},null,{"$f":"IF(K61=\"\",0,K61*(60/E$56)^IF(M61<>\"\",1/M61,IF(E$56>60,1,0.5)))","v":0},{"$f":"IF(U61>0,U10/U61,0)","v":0}]
[null,{"$f":"IF(B$11=\"\",IF(D$11=\"\",\"\",D$11),B$11)","v":""},null,{"$f":"AD$9","v":""},null,null,{"$f":"IF(E62=\"\",D62,IF(AND(F62=\"mg/cu m\",J11=0),0,IF(F62=\"mg/cu m\",ROUND(E62*24.45/J11,2),IF(F62=\"vol %\",E62*10000,E62))))","v":""},{"$f":"AD$10","v":""},null,null,{"$f":"IF(I62=\"\",H62,IF(AND(J62=\"mg/cu m\",J11=0),0,IF(J62=\"mg/cu m\",ROUND(I62*24.45/J11,2),IF(J62=\"vol %\",I62*10000,I62))))","v":""},"ppm",null,null,null,{"$f":"IF(B$11=\"\",IF(D$11=\"\",\"\",D$11),B$11)","v":""},null,{"$f":"IF(G62=\"\",0,G62*(60/E$56)^IF(M62<>\"\",1/M62,IF(E$56>60,1,0.5)))","v":0},0,null,{"$f":"IF(K62=\"\",0,K62*(60/E$56)^IF(M62<>\"\",1/M62,IF(E$56>60,1,0.5)))","v":0},{"$f":"IF(U62>0,U11/U62,0)","v":0}]
[null,{"$f":"IF(B$12=\"\",IF(D$12=\"\",\"\",D$12),B$12)","v":""},null,{"$f":"AE$9","v":""},null,null,"",{"$f":"AE$10","v":""},null,null,"","ppm",null,null,null,{"$f":"IF(B$12=\"\",IF(D$12=\"\",\"\",D$12),B$12)","v":""},null,{"$f":"IF(G63=\"\",0,G63*(60/E$56)^IF(M63<>\"\",1/M63,IF(E$56>60,1,0.5)))","v":0},0,null,{"$f":"IF(K63=\"\",0,K63*(60/E$56)^IF(M63<>\"\",1/M63,IF(E$56>60,1,0.5)))","v":0},{"$f":"IF(U63>0,U12/U63,0)","v":0}]
[null,{"$f":"IF(B$13=\"\",IF(D$13=\"\",\"\",D$13),B$13)","v":""},null,{"$f":"AF$9","v":""},null,null,"",{"$f":"AF$10","v":""},null,null,"","ppm",null,null,null,{"$f":"IF(B$13=\"\",IF(D$13=\"\",\"\",D$13),B$13)","v":""},null,{"$f":"IF(G64=\"\",0,G64*(60/E$56)^IF(M64<>\"\",1/M64,IF(E$56>60,1,0.5)))","v":0},0,null,{"$f":"IF(K64=\"\",0,K64*(60/E$56)^IF(M64<>\"\",1/M64,IF(E$56>60,1,0.5)))","v":0},{"$f":"IF(U64>0,U13/U64,0)","v":0}]
[null,null,null,null,null,null,null,null,null,null,null,null,null,null,null,null,null,"S yi / ERPG-2'i =",{"$f":"SUM(S60:S64)","v":0},null,"S yi / ERPG-3'i =",{"$f":"SUM(V60:V64)","v":0}]
[null,null,null,null,null,null,null,null,null,null,null,null,null,null,null,null,null,"ERPG-2'Mixture = 1 / (S yi / ERPG-2'i) = ",{"$f":"IF(S65>0,1/S65,\"\")","v":""},null,"ppmv        ERPG-3'Mixture =",{"$f":"IF(V65>0,1/V65,\"\")","v":""},"ppmv"]
[null,null,null,null,null,null,null,null,null,null,null,null,null,null,null,null,"Note: n is assumed 2 for interpolation of exposure duration less than one hour and 1 for extrapolation of exposure duration to greater than one hour if not entered"]
[]
[]
[]
[null,"Copyright © 2026"]
[null,"American Institute of Chemical Engineers"]

{"sheet":"Reactivity Hazards","index":2,"n_rows":51,"n_cols":24,"rows_kept":51,"cut":false,"hidden":false,"merged":[[0,19,1,19],[23,10,25,16],[42,10,44,16],[33,10,35,16],[7,3,7,6],[4,1,5,7]]}
[null,null,null,null,null,null,null,null,null,null,null,null,null,null,null,null,null,null,null,"Conversion Factors"]
[null,null,null,null,"REACTIVITY HAZARDS INPUT INFORMATION",null,null,null,null,null,null,null,null,"ln(Vap Press) = A -B / (T + 273)",null,null,null,null,null,null,null,"Trial TNR Temp 1",{"$f":"F37+20","v":20},"C"]
[null,null,null,null,"Required Inputs are Shaded \"Yellow\"",null,null,null,null,null,null,"Initial Temperature for Plot = ",{"$f":"MIN(F11,0)","v":0},"C","Vap Press A",{"$f":"IF(F28>0,LN(F28)+P4/(D28+273),0)","v":0},null,null,null,{"$f":"IF(E12<>\"\",VLOOKUP(E12,Conversion_Table,2,0),1)","v":1},null,"Trial TNR Temp 2",{"$f":"1/(LN(F$35*F$36*IF(W2>F$37+1,W2-F$37,1)*60/(F$16*F$17)/(F$13*IF(D$21=\"\",1,D$21)))*8.3145/(-1000*F$14)+1/(F$11+273))-273","v":{"$error":"#DIV/0!"}},"C"]
[null,"Description:",null,null,null,null,null,null,null,null,null,"Maximum Temperature Rise for Plot = ",{"$f":"M3+IF(D19<>\"Endothermic\",IF(F16>0,F15/F16,0.01),0.01)","v":0.01},"C","Vap Press B",{"$f":"IF(AND(F28>0,F29>0,D28<>D29),(LN(F28)-LN(F29))/(1/(D29+273)-1/(D28+273)),0)","v":0},null,null,null,{"$f":"IF(E13<>\"\",VLOOKUP(E13,Conversion_Table,2,0),1)","v":1},null,"Trial TNR Temp 3",{"$error":"#DIV/0!"},"C"]
[null,null,null,null,null,null,null,null,null,null,null,"Vap Press at Initial Temperature = ",{"$f":"IF(D20<>\"Vapor\",EXP(P$3-P$4/(F$11+273))/100,0)","v":0.01},"bar","Pad Gas = ",{"$f":"IF(F12+1.013-M5>0,F12+1.013-M5,0)","v":1.0029999999999999},"bar",null,null,{"$f":"IF(E14<>\"\",VLOOKUP(E14,Conversion_Table,2,0),1)","v":1},null,"Trial TNR Temp 4",{"$error":"#DIV/0!"},"C"]
[null,null,null,null,null,null,null,null,null,null,null,"Conversion","Temp, C","Vap Press, bar","Total Press, bar","Temp Rate","Cool Rate, C/min",null,null,{"$f":"IF(E15<>\"\",VLOOKUP(E15,Conversion_Table,2,0),1)","v":1},null,"Trial TNR Temp 5",{"$error":"#DIV/0!"},"C"]
[null,null,null,null,null,null,null,null,null,null,null,0,{"$f":"M3","v":0},{"$f":"IF(AND(D$20<>\"Vapor\",D$19<>\"Endothermic\"),EXP(P$3-P$4/(M7+273))/100,NA())","v":0.01},{"$f":"IF(AND(D$20<>\"Vapor\",D$19<>\"Endothermic\"),EXP(P$3-P$4/(M7+273))/100,0)+P$5*(M7+273)/(F$11+273)+0.08345*L7*F$18*(M7+273)*IF(AND(D$20<>\"Vapor\",D$22<>\"\"),D$22/(1.01-D$22),1)","v":1.0129999999999999},{"$f":"IF(D$19=\"Endothermic\",NA(),F$13*IF(D$21=\"\",1,D$21)*(1-L7)*EXP((-1000*F$14/8.3145)*(1/(M7+273)-1/(F$11+273))))","v":0},{"$f":"IF(AND(F$17>0,M7>F$37),F$35*F$36*(M7-F$37)*60/(F$16*F$17),NA())","v":{"$error":"#N/A"}},null,null,{"$f":"IF(E17<>\"\",VLOOKUP(E17,Conversion_Table,2,0),1)","v":1},null,"Trial TNR Temp 6",{"$error":"#DIV/0!"},"C"]
[null,null,"Select Reactivity Screening Estimate ",null,null,null,null,null,null,null,null,1E-3,{"$f":"(M3+F11)/2","v":0},0.01,1.0129999999999999,0,{"$error":"#N/A"},null,null,{"$f":"IF(E18<>\"\",VLOOKUP(E18,Conversion_Table,2,0),1)","v":1},null,"Trial TNR Temp 7",{"$error":"#DIV/0!"},"C"]
[null,null,null,null,null,null,null,null,null,null,null,5.0000000000000001E-3,{"$f":"F11","v":0},0.01,1.0129999999999999,0,{"$error":"#N/A"},null,null,{"$f":"IF(G26<>\"\",VLOOKUP(G26,Conversion_Table,2,0),1)","v":1},null,"Trial TNR Temp 8",{"$error":"#DIV/0!"},"C"]
[null,null,null,"Input Value","Input Units","Equation Input"," Equation Units",null,null,null,null,0.1,{"$f":"F$11+L10*M$4","v":1E-3},0.01,1.0130036739926738,0,{"$error":"#N/A"},null,null,{"$f":"IF(G27<>\"\",VLOOKUP(G27,Conversion_Table,2,0),1)","v":1},null,"Trial TNR Temp 9",{"$error":"#DIV/0!"},"C"]
[null,"Initial (or Detected Onset) Temperature, T0",null,null,null,{"$f":"IF(E11=\"F\",ROUND((D11-32)/1.8,1),D11)","v":0},"C",null,null,null,null,0.2,2E-3,0.01,1.0130073479853479,0,{"$error":"#N/A"},null,null,{"$f":"IF(E16<>\"\",VLOOKUP(E16,Conversion_Table,2,0),1)","v":1},null,"Trial TNR Temp 10",{"$error":"#DIV/0!"},"C"]
[null,"Initial Pressure, P0",null,null,null,{"$f":"IF(E12<>\"\",D12*T3,D12)/100","v":0},"bar gauge",null,null,null,null,0.3,3.0000000000000001E-3,0.01,1.013011021978022,0,{"$error":"#N/A"},null,null,{"$f":"IF(E35<>\"\",VLOOKUP(E35,Conversion_Table,2,0),1)","v":1}]
[null,"Initial Observed Temperature Rate, r0",null,null,null,{"$f":"IF(E13<>\"\",D13*T4,D13)","v":0},"C/min",null,null,null,null,0.4,4.0000000000000001E-3,0.01,1.013014695970696,0,{"$error":"#N/A"},null,null,{"$f":"IF(E36<>\"\",VLOOKUP(E36,Conversion_Table,2,0),1)","v":1}]
[null,"Activation Energy, DE",null,null,null,{"$f":"IF(E14<>\"\",D14*T5,D14)","v":0},"kJ/g mole",null,null,null,null,0.5,5.0000000000000001E-3,0.01,1.0130183699633699,0,{"$error":"#N/A"}]
[null,"Heat of Reaction per Mass, DHr",null,null,null,{"$f":"IF(E15<>\"\",ABS(D15*T6),ABS(D15))","v":0},"kJ/kg",null,null,null,null,0.6,6.0000000000000001E-3,0.01,1.0130220439560438,0,{"$error":"#N/A"}]
[null,"Contents Average Heat Capacity, C",null,null,null,{"$f":"IF(E16<>\"\",D16*T11,D16)","v":0},"kJ/kg C",null,null,null,null,0.7,6.9999999999999993E-3,0.01,1.0130257179487179,0,{"$error":"#N/A"}]
[null,"Total Reaction Mass",null,null,null,{"$f":"IF(E17<>\"\",D17*T7,D17)","v":0},"kg",null,null,null,null,0.8,8.0000000000000002E-3,0.01,1.0130293919413917,0,{"$error":"#N/A"}]
[null,"Net Mole Vapor Generated/Liter Contents",null,null,null,{"$f":"IF(E18<>\"\",D18*T8,D18)","v":0},"g mole/liter contents",null,null,null,null,0.9,9.0000000000000011E-3,0.01,1.0130330659340658,0,{"$error":"#N/A"}]
[null,"Exothermic or Endothermic Reaction",null,null,"Assumed Exothermic if blank",null,null,null,null,null,null,0.95,9.4999999999999998E-3,0.01,1.0130349029304027,0,{"$error":"#N/A"}]
[null,"Vapor or Liquid Phase Reaction",null,null,"Assumed Liquid if blank",null,null,null,null,null,null,0.98,9.7999999999999997E-3,0.01,1.013036005128205,0,{"$error":"#N/A"}]
[null,"Thermal Inertia of Testing Device",null,null,"Note: A value of 1 indicates an adiabatic data.  Assumed 1 if blank.",null,null,null,null,null,null,0.99,9.9000000000000008E-3,0.01,1.0130363725274725,0,{"$error":"#N/A"}]
[null,"Equipment of Vessel Fill Fraction, FF",null,null,"Assumed 0.5 if blank",null,null,null,null,null,null,0.995,9.9500000000000005E-3,0.01,1.0130365562271062,0,{"$error":"#N/A"}]
[null,null,null,null,null,"Vol Ratio (Vr / VV) = 1 for vapor phase or Fill Fr / (1 - Fill Fr) for liquid phase reaction = ",{"$f":"IF(OR(D20=\"Vapor\",D22=\"\"),1,D22/(1-D22))","v":1}]
[null,null,null,{"$f":"IF(OR(F14>200,F14<30),\"Activation Energy Outside of Normal Range\",\"\")","v":"Activation Energy Outside of Normal Range"},null,null,null,null,null,null,"MAXIMUM ADIABATIC TEMPERATURE and PRESSURE\nReactivity Hazards - section 5.7"]
[null,null,null,"Temperature","Temp Units","Vapor Press","Pressure Units"]
[null,"Input Temperature 1 and Vap Press 1"]
[null,"Input Temperature 2 and Vap Press 2"]
[null,"Vapor Pressure at Temperature 1",null,{"$f":"IF(E26=\"F\",ROUND((D26-32)/1.8,1),D26)","v":0},"C",{"$f":"IF(G26<>\"\",F26*T9,F26)","v":0},"kPa absolute",null,null,null,"Maximum Adiabatic Temperature (equation 5-1), TMax = T0 - DHr / C"]
[null,"Vapor Pressure at Temperature 2",null,{"$f":"IF(E27=\"F\",ROUND((D27-32)/1.8,1),D27)","v":0},"C",{"$f":"IF(G27<>\"\",F27*T10,F27)","v":0},"kPa absolute",null,null,null,null,"TMax = ",{"$f":"ROUND(F11,1)&\" + \"&ROUND(F15,1)&\" / \"&ROUND(F16,3)&\" = \"","v":"0 + 0 / 0 = "},null,{"$f":"IF(D16=\"\",0,ROUND(F11+F15/F16,1))","v":0},"C"]
[null,null,null,null,"Estimated Vap Pressure at Initial Reaction Temperature, PVP@To = ",{"$f":"IF(D11=\"\",0,EXP(P3-P4/(F11+273))/100)","v":0},"bar"]
[null,null,null,null,"Estimated Vap Pressure at Max Reaction Temperature, PVP@Tmax = ",{"$f":"IF(O29=\"\",\"\",EXP(P3-P4/(O29+273))/100)","v":0.01},"bar",null,null,"Maximum Adiabatic Pressure (equation 5-2), Pmax = Ppad (Tmax / T0 ) + PVP@Tmax + b R Tmax ( Vr / VV)"]
[null,null,null,null,"Estimated Pad Gas Pressure at T0 = P0 - PVP@To = ",{"$f":"IF(F30=\"\",\"\",F12+1.013-F30)","v":1.0129999999999999},"bar",null,null,"Pmax = ",{"$f":"ROUND(F32,2)&\" ( \"&O29&\"+273 ) / (\"&ROUND(F11,1)&\"+273 ) + \"&ROUND(F31,2)&\" + \"&ROUND(F18,4)&\" ( 0.083 ) (\"&O29&\"+273) ( \"&ROUND(G23,2)&\" ) =\"","v":"1.01 ( 0+273 ) / (0+273 ) + 0.01 + 0 ( 0.083 ) (0+273) ( 1 ) ="},null,null,null,null,null,{"$f":"F32*(O29+273)/(F11+273)+F31+F18*0.083*(O29+273)*G23","v":1.0229999999999999},"bar"]
[]
[null,null,null,"Input Value","Input Units","Equation Input"," Equation Units",null,null,null,"TEMPERATURE OF NO RETURN - Exothermic Reaction\nReactivity Hazards - section 5.16"]
[null,"Equipment or Vessel Heat Transfer Area, A",null,null,null,{"$f":"IF(E35<>\"\",D35*T12,D35)","v":0},"m2"]
[null,"Heat Loss Coefficient, U",null,null,null,{"$f":"IF(E36<>\"\",D36*T13,D36)","v":0},"kWatt/m2 C"]
[null,"Coolant Temperature, TCoolant",null,null,null,{"$f":"IF(E37=\"F\",ROUND((D37-32)/1.8,1),D37)","v":0},"C"]
[null,"Ref Temperature for Time to Max Rate, TRef",null,null,null,{"$f":"IF(E38=\"F\",ROUND((D38-32)/1.8,1),D38)","v":0},"C",null,null,null,"Temperature of No Return (equation 5-4), TNR = 1 / [R ln (r0 / rTNR) / DE + 1 / T0]"]
[null,null,null,null,"Estimated Temp Rate at TREF, qREF = ",{"$f":"IF(D$19=\"Endothermic\",NA(),F$13*IF(D$21=\"\",1,D$21)*EXP((-1000*F$14/8.3145)*(1/(F38+273)-1/(F$11+273))))","v":0},"C/min",null,null,null,"where rTNR = U A (TNR - Tcoolant) / ( M C )"]
[]
[null,null,null,null,null,null,null,null,null,null,null,null,null,"TNR solved by trial and error or graphically yields: ",{"$f":"IF(OR(F13=0,F16=0,F35=0,F36=0),\"\",IF(W11<F37,\"< Coolant T\",W11))","v":""},"C"]
[]
[null,"Copyright © 2026",null,null,null,null,null,null,null,null,"TIME TO MAXIMUM RATE - Exothermic Reaction\nReactivity Hazards - section 5.17"]
[null,"American Institute of Chemical Engineers"]
[]
[]
[null,null,null,null,null,null,null,null,null,null,"Time to Maximum Rate (equation 5-5), tMR = R TRef2 / ( rRef  DE )"]
[null,null,null,null,null,null,null,null,null,null,"where rRef determined by thermal kinetic expression: r = r0 exp[ -( DE / R ) ( 1 / TRef - 1 / T0 )"]
[]
[null,null,null,null,null,null,null,null,null,null,"tMR =",{"$f":"\"8.3145 ( \"&ROUND(F38,1)&\" + 273 )^2 / ( \"&ROUND(F39,3)&\" ( \"&ROUND(1000*F14,1)&\" ) ) = \"","v":"8.3145 ( 0 + 273 )^2 / ( 0 ( 0 ) ) = "},null,null,null,{"$f":"IF(OR(F11=0,F39=0),\"\",8.3145*(F38+273)^2/(1000*F39*F14))","v":""},"min"]
[null,null,null,null,null,null,null,null,null,null,null,null,null,null,"or",{"$f":"IF(P50=\"\",\"\",IF(P50<6,P50*60,IF(P50>6000,P50/1440,IF(P50>600,P50/60,P50))))","v":""},{"$f":"IF(P50<6,\"sec\",IF(P50>6000,\"day\",IF(P50>600,\"hour\",\"min\")))","v":"day"}]

{"sheet":"Example Scenarios","index":3,"n_rows":79,"n_cols":9,"rows_kept":79,"cut":false,"hidden":false,"merged":[[78,1,78,6],[41,1,41,6],[1,1,2,6],[9,8,40,8],[47,8,58,8],[59,1,59,6],[65,8,77,8]]}
[]
[null,"Below are example scenarios for general chemical process equipment, fired equipment, and solids handling equipment as described in the CHEF Guide under \"What Could Go Wrong?\".  Each scenario group contains selected initiating events, typical loss events, and potential incident outcome for common equipment.  Each entry is aligned with one or more deviations of a process parameter or common failure mode.  This is not intended as a complete listing, but a starting point for Hazard Identification and Risk Analysis study teams in identifying scenarios for risk analysis."]
[]
[null,"Common Chemical Process Equipment"]
[null,"Fired Equipment"]
[null,"Solids Handling Equipment"]
[]
[null,"Go to Top","Example Listing of scenario groups for Common Chemical Process Equipment per Scenario Development - section 11.8"]
[null,"Scenario or Hazard Category","Parameter/ Deviation","Applicable Equipment","Initiating Events\n(Partial List)","Loss Event*","Incident Outcome",null,"Notes:"]
[null,"Blocked-In with Thermal Expansion","Flow-No","Drum Oven\nHeat Exchanger\nPiping, Pump**","Procedure Failure (Human Error)\nFlow Control Failure","Gasket Leak\nEquipment Rupture\nEquipment Damage","Flammable Release\nToxic Release\nChemical Exposure",null,"Thermal expansion may result in a gasket leak that goes undetected (only material within the blocked -in region would initially leak) until the equipment or piping returns to normal operation."]
[null,"Casing or Containment Failure","Flow-Loss of Containment","Pump","Canned or Magnetic Drive Failure","Small Hole Leak","Flammable Release\nToxic Release\nChemical Exposure"]
[null,"Connection Failure","Flow-Loss of Containment","Drum/IBC Handling\nTank Truck/Rail Car/Tote","Procedure Failure (Human Error)","Gasket Leak","Flash Fire or Fireball\nChemical Exposure"]
[null,"Damage from Movement","Flow-Loss of Containment","Tank Truck/Rail Car/Tote","Procedure Failure (Human Error)","Full-Bore Leak","Flammable Release\nToxic Release\nChemical Exposure"]
[null,"Drain or Vent Valve Open","Flow-Loss of Containment","All","Procedure Failure (Human Error)\nFlow Control Failure","Drain or Vent Leak","Flammable Release\nToxic Release\nChemical Exposure"]
[null,"Excessive Heat Input - Heat Transfer","Temperature-High\nPressure-High\nHeat Input-High","All with Heat Transfer Capability","Temperature Control Failure\nResidence Time Failure (Solids)\nFeed rate Control Failure","Relief Venting\nEquipment Rupture\nEquipment Damage","Flammable Release\nToxic Release\nFlash Fire or Fireball\nPhysical Explosion\nBusiness Loss"]
[null,"Excessive Heat Input - Mechanical or Frictional","Temperature-High\nPressure-High\nHeat Input-High","All with Mixing, Fluid Movement, or Electric Heating","Bearing or Seal Failure\nMechanical Failure\nSpeed Control Failure","Relief Venting\nEquipment Rupture\nEquipment Damage","Flammable Release\nToxic Release\nFlash Fire or Fireball\nPhysical Explosion\nBusiness Loss"]
[null,"Excessive Heat Input - Pool Fire Exposure","Temperature-High\nPressure-High\nHeat Input-High","All","Scenarios involving spill plus ignition in nearby liquid-containing equipment","Relief Venting\nEquipment Rupture\nEquipment Damage","Flammable Release\nToxic Release\nFlash Fire or Fireball\nPhysical Explosion\nBusiness Loss"]
[null,"Excessive Pad Gas Pressure","Flow-High","All","Flow Control Failure\nPressure Control Failure\nProcedure Failure (Human Error)","Gasket Leak\nRelief Venting\nEquipment Rupture","Flammable Release\nToxic Release\nPhysical Explosion\nBusiness Loss"]
[null,"Exhaustion of Scrubbing Media","Composition-Wrong Concentration","Adsorber/Scrubber\nVapor Quench","Flow Control Failure\nProcedure Failure (Human Error)","Vent Release","Flammable Release\nToxic Release"]
[null,"High Temperature Failure","Temperature-High","Vapor Quench","Flow Control Failure","Equipment Failure","Toxic Release\nPhysical Explosion\nBusiness Loss"]
[null,"Hose or Loading Arm Connection","Flow-Loss of Containment","Drum/IBC Handling\nTank Truck/Rail Car/Tote","Procedure Failure (Human Error)","Gasket Leak","Flammable Release\nToxic Release\nChemical Exposure"]
[null,"Hydraulic Surge","Flow-Loss of Containment","Piping\nPump**","Flow Control Failure\nProcedure Failure (Human Error)","Gasket Leak","Flammable Release\nToxic Release\nChemical Exposure"]
[null,"Ignitable Headspace","Composition-Wrong Concentration\nElectrostatic Charge-High\nElectrical Conductivity-Low","All but Liquid-Full Equipment","Flow Control Failure\nFailure of Bonding or Grounding\nParticle Size Control Failure (Solids)\nWrong Type or Damaged Bag, Pak or Drum (Solids)\nImproper Changing Dust Collector Bag or Screen (Solids)","Gasket Leak\nEquipment Rupture\nEquipment Damage","Flammable Release\nToxic Release\nFlash Fire or Fireball\nPhysical Explosion\nBusiness Loss"]
[null,"Liquid in Vapor Feed","Level-High","Compressor or Blower\nTurbine or Gas Expander","Level Control Failure","Equipment Damage","Chemical Exposure"]
[null,"Loss of Flow - Adsorber or Scrubber","Flow-Low","Adsorber/Scrubber\nVapor Quench","Flow Control Failure\nPump Failure","Vent Release","Flammable Release\nToxic Release"]
[null,"Low Temperature Embrittlement","Temperature-Low","All","Temperature Control Failure\nLeak of Liquified Gas","Full-Bore Leak","Flammable Release\nToxic Release"]
[null,"Mechanical Integrity Failure - Large","Flow-Loss of Containment","All - to address Residual Failures","Residual Failure","Very Large Hole Size Leak","Flammable Release\nToxic Release\nChemical Exposure"]
[null,"Mechanical Integrity Failure - Small","Flow-Loss of Containment","All - to address Residual Failures","Residual Failure","Very Small Hole Size Leak","Flammable Release\nToxic Release\nChemical Exposure"]
[null,"Overfill, Overflow, or Backflow","Level-High\nFlow-Backflow","All Liquid Containing Equipment","Level Control Failure\nProcedure Failure (Human Error)","Overflow Release\nEquipment Damage\nEquipment Rupture","Flammable Release\nToxic Release\nPhysical Explosion\nBusiness Loss"]
[null,"Overflow - Flooding or Plugging","Level-High","Adsorber/Scrubber\nDistillation\nVapor Quench","Level Control Failure\nPressure Control Failure\nFlow Control Failure","Overflow Release\nEquipment Damage\nEquipment Rupture","Flammable Release\nToxic Release\nPhysical Explosion\nBusiness Loss"]
[null,"Physical Damage or Puncture","Flow-Loss of Containment","Drum/IBC Handling\nPiping\nPump**","Procedure Failure (Human Error)","Full-Bore Leak","Flammable Release\nToxic Release"]
[null,"Piping or Equipment Leak - Full Bore","Flow-Loss of Containment","All","Hose Failure\nPipe Failure\nMechanical Failure (nozzle)","Full-Bore Leak","Flammable Release\nToxic Release\nChemical Exposure"]
[null,"Piping or Equipment Leak - Small","Flow-Loss of Containment","All","Procedure Failure (Human Error)\nMechanical Failure (Loading Arm, etc.)","Small Hole Size Leak","Flammable Release\nToxic Release\nChemical Exposure"]
[null,"Pump Deadhead","Flow-No\nTemperature-High","Pump","Flow Control Failure\nProcedure Failure (Human Error)\nUtility Failure","Equipment Rupture","Flammable Release\nToxic Release\nPhysical Explosion\nBusiness Loss"]
[null,"Relief Device Failure","Flow-Loss of Containment","All","Mechanical Failure","Relief Hole Size Leak","Flammable Release\nToxic Release\nChemical Exposure"]
[null,"Rotating Equipment Damage","Speed-High","All Rotating Equipment","Speed Control Failure\nMechanical Failure","Equipment Rupture\nEquipment Damage","Flammable Release\nToxic Release\nFlash Fire or Fireball\nPhysical Explosion\nBusiness Loss"]
[null,"Seal Leak","Flow-Loss of Containment","Compressor or Blower\nPump, Turbine or Gas Expander\nStirred Reactor/Crystallizer","Mechanical Seal Failure\nUtility Failure\nProcedure Failure (Human Error)","Mechanical Seal Hole Size Leak","Flammable Release\nToxic Release\nChemical Exposure"]
[null,"Tube Failure","Flow-Loss of Containment","Heat Exchanger","Heat Exchanger Tube Failure","Tube Hole Size Leak","Flammable Release\nToxic Release\nBusiness Loss"]
[null,"Uncontrolled Reaction ","Reaction-High Rate\nTemperature-High\nComposition-Wrong","All","Flow Control Failure\nTemperature Control Failure","Relief Venting\nEquipment Rupture","Flammable Release\nToxic Release\nFlash Fire or Fireball\nPhysical Explosion\nBusiness Loss"]
[null,"Uncontrolled Reaction - Incompatible Materials","Reaction-Wrong Reaction","All","Addition of Wrong Recipe (Human Error)\nAddition of Wrong Material (Human Error)","Equipment Rupture","Flammable Release\nToxic Release\nFlash Fire or Fireball\nPhysical Explosion\nBusiness Loss"]
[null,"Vacuum Damage","Pressure-Low","All","Pressure Control Failure\nMechanical Failure","Full-Bore Leak\nEquipment Damage","Flammable Release\nToxic Release\nBusiness Loss"]
[null,"  *Each Loss Event represents separate Scenarios\n **Where Piping included with Pump\n***Equipment Failure represents total loss of containment without Physical Explosion"]
[]
[]
[]
[null,"Go to Top",null,"Example Listing of scenario groups for Common Fired Equipment"]
[null,"Scenario or Hazard Category","Parameter/ Deviation","Applicable Equipment","Initiating Events\n(Partial List)","Loss Event*","Incident Outcome",null,"Notes:"]
[null,"Accumulation of Untreated Vent or Waste","Flow-High","Fired Equipment - Incinerator or TTU\nVapor Quench","Flow Control Failure","Vent Release","Flammable Release\nToxic Release",null,"\n\nThe initiating cause for \"flash-back of vent to fired equipment\" occurs in the fired equipment unit while the loss event may occur in any interconnected equipment containing combustible vapor or dust."]
[null,"Flash Back of Vent to Fired Equipment","Composition-Wrong Concentration","All Interconnected Equipment","Flow Control Failure\nPressure Control Failure\nProcedure Failure (Human Error)","Equipment Rupture\nEquipment Damage","Flash Fire or Fireball\nPhysical Explosion\nBusiness Loss"]
[null,"Fuel Accumulation during Light Off","Flow-High","Fired Equipment - Combustion Unit\nFired Equipment - Fire Tube Unit\nFired Equipment - Incinerator or TTU","Flow Control Failure\nMechanical Failure (Damper or Blower)","Equipment Rupture\nEquipment Damage","Flash Fire or Fireball\nPhysical Explosion\nBusiness Loss"]
[null,"Fuel Accumulation during Operation","Flow-High","Fired Equipment - Combustion Unit\nFired Equipment - Fire Tube Unit\nFired Equipment - Incinerator or TTU","Flow Control Failure\nMechanical Failure (Damper or Blower)","Equipment Rupture\nEquipment Damage","Flash Fire or Fireball\nPhysical Explosion\nBusiness Loss"]
[null,"Fuel Accumulation while Down","Flow-High","Fired Equipment - Combustion Unit\nFired Equipment - Fire Tube Unit\nFired Equipment - Incinerator or TTU","Flow Control Failure\nProcedure Failure (Human Error)","Vent Release\nEquipment Rupture\nEquipment Damage","Flash Fire or Fireball\nPhysical Explosion\nBusiness Loss"]
[null,"High Fuel Flow or Energy Content","Flow-High","Fired Equipment - Combustion Unit\nFired Equipment - Fire Tube Unit\nFired Equipment - Incinerator or TTU","Flow Control Failure","Equipment Damage","Flash Fire or Fireball\nPhysical Explosion\nBusiness Loss"]
[null,"High Temperature Failure","Temperature-High","Vapor Quench","Flow Control Failure","Equipment Failure","Toxic Release\nPhysical Explosion\nBusiness Loss"]
[null,"Liquid in Vapor Feed","Level-High","Compressor or Blower\nTurbine or Gas Expander","Level Control Failure","Flaming Liquid Release","Chemical Exposure"]
[null,"Loss of Flow or Level - Fired Equipment","Level-Low","Fired Equipment-Process Heater","Flow Control Failure\nLevel Control Failure\nPump Failure","Equipment Failure***","Flammable Release\nToxic Release"]
[null,"Loss of Pilot or Ignition","Composition-Wrong Concentration","Fired Equipment-Flare","Flow Control Failure\nMechanical Failure (Ignitor)","Vent Release","Flammable Release\nToxic Release"]
[null,"Loss of Vacuum - Thermal Oxidizer","Pressure-Low","Fired Equipment-Incinerator or TTU","Pressure Control Failure\nMechanical Failure (Blower)","Vent Release","Flammable Release\nToxic Release"]
[null,"Plugged or Frozen Vent Line","Flow-No","Fired Equipment-Flare","Temperature Control Failure\nUtility Failure","Equipment Damage","Business Loss"]
[null,"  *Each Loss Event represents separate Scenarios"]
[]
[]
[]
[null,"Go to Top",null,"Example Listing of scenario groups for Common Dust Handling Equipment"]
[null,"Scenario or Hazard Category","Parameter/ Deviation","Applicable Equipment","Initiating Events\n(Partial List)","Loss Event*","Incident Outcome",null,"Notes:"]
[null,"Connection Failure","Flow-Loss of Containment","All Dust Handling Equipment","Boot or Flex Hose Failure (Solids)","Gasket Leak\nSolids Spill","Flash Fire or Fireball\nChemical Exposure",null,"Rotating Equipment includes Blenders, Mills, Grinders, Screw Conveyors, Air Classifiers, and Agitated Dryers or Agitated Vessels.  These types of equipment (in addition to Bucket Elevators) operate with internal dust clouds, may have rotating parts, and prone to solids build-up or  tramp metal issues.\n\nIf the maximum ignition energy from the source can not exceed the dust MIE, the scenario may not be credible. Human Discharge (up to 30 mJ), Propagating Brush discharge (up to 1000 mJ) associated with flowing material, Conical Pile or Bulking Brush Discharge (20 mJ for large volumes to 1 for piles > 1 m3 ) versus very high energy for mechanical sparks involving high speed rotating equipment > 10 m/sec tip speed.\n\nProbability of Ignition\n     Probability of Ignition increases for high-speed rotating equipment or fluidized equipment due to dust concentration in the combustible range and mechanical sparks from striking tramp metal or grinder/mill media.\n     Probability of Ignition increases with mix of dust and pellets, depth of solids (conical brush),  solids velocity (bulking brush or propagating brush), non-conductive sections of conveyors for viewing, and non-conductive hoses or flexible connections. (propagating brush).\n     Probability of Ignition increases with decreasing minimum ignition energy including small particles and/or hybrid mixtures.\n\nLoss of Grounding or Bonding includes inadequate Human Grounding, improper use of non-conductive components, non-conductive build-up on equipment surfaces, in addition to physical loss of ground connections (including hoses and bulk bags) or cage failure in dust collectors.\n\nAddition of Wrong Material may include changes in moisture or particle size (which can impact MIE or cause material build-up/strain on rotating equipment) in addition to chemical contamination which may lead to uncontrolled reaction.\n\nThe Initiating Events for “Propagation of Flame or Burning Ember” and “Dust Accumulation in Process Area” are results of evaluation for other LOPA Scenarios (possibly involving upstream equipment items and Domino Effect).  The Initiating Event frequency is estimated as the summation of frequencies for all contributing scenarios rather than simple Cause-Consequence LOPA.\n"]
[null,"Dust Accumulation in Process Area","Flow-Loss of Containment","All Solids Handling Equipment","Any scenario that could dislodge accumulated dust (explosion within nearby equipment, etc.)","Secondary Dust Release","Building Explosion"]
[null,"Excessive Heat Input - Heat Transfer","Temperature-High\nPressure-High\nHeat Input-High","All with Heat Transfer Capability (such as Dryer)","Temperature Control Failure\nResidence Time Failure (Solids)\nFeed rate Control Failure","Internal Dust Explosion\nEquipment Damage\nSmoldering Particles","Fireball\nPhysical Explosion\nBusiness Loss"]
[null,"Excessive Heat Input - Mechanical or Frictional","Temperature-High\nPressure-High\nHeat Input-High","All with Mixing, Fluid Movement, or Electric Heating","Bearing or Seal Failure\nMechanical Failure\nSpeed Control Failure","Internal Dust Explosion\nEquipment Damage\nSmoldering Particles","Fireball\nPhysical Explosion\nBusiness Loss"]
[null,"Ignitable Headspace","Composition-Wrong Concentration\nElectrostatic Charge-High\nElectrical Conductivity-Low","All","Flow Control Failure\nFailure of Bonding or Grounding\nParticle Size Control Failure (Solids)\nWrong Type or Damaged Bag, Pak or Drum (Solids)\nImproper Changing Dust Collector Bag or Screen (Solids)","Internal Dust Explosion\nEquipment Damage\nSmoldering Particles","Fireball\nPhysical Explosion\nBusiness Loss"]
[null,"Introduction of Foreign Material","Composition-Contaminants","Rotating Equipment\nMechanical Conveyor (Solids)","Mechanical Failure\nProcedure Failure (Human Error)","Internal Dust Explosion\nEquipment Damage\nSmoldering Particles","Fireball\nPhysical Explosion\nBusiness Loss"]
[null,"Physical Damage or Puncture","Flow-Loss of Containment","Drum/IBC Handling","Procedure Failure (Human Error)","Solids Spill","Chemical Exposure\nPrimary Dust Explosion"]
[null,"Pressure Damage","Pressure-High","All Dust Handling Equipment","Pressure Control Failure\nRegulator Failure","Solids Spill\nEquipment Rupture","Chemical Exposure\nPrimary Dust Explosion"]
[null,"Propagation of Flame or Burning Ember","Composition-Foreign","All Dust Handling Equipment","Any upstream scenario resulting in explosion or smoldering particles (Solids)","Equipment Rupture","Fireball\nPhysical Explosion\nBusiness Loss"]
[null,"Rotating Equipment Damage","Speed-High","All Rotating Equipment","Speed Control Failure\nMechanical Failure","Internal Dust Explosion\nEquipment Damage\nSmoldering Particles","Fireball\nPhysical Explosion\nBusiness Loss"]
[null,"Uncontrolled Reaction ","Reaction-High Rate\nTemperature-High\nComposition-Wrong","All","Flow Control Failure\nTemperature Control Failure","Internal Dust Explosion\nEquipment Damage\nSmoldering Particles","Fireball\nPhysical Explosion\nBusiness Loss"]
[null,"Uncontrolled Reaction - Incompatible Materials","Reaction-Wrong Reaction","All","Addition of Wrong Recipe (Human Error)\nAddition of Wrong Material (Human Error)","Internal Dust Explosion\nEquipment Damage\nSmoldering Particles","Fireball\nPhysical Explosion\nBusiness Loss"]
[null,"Vacuum Damage","Pressure-Low","All","Pressure Control Failure\nMechanical Failure","Solids Spill\nEquipment Damage","Chemical Exposure\nPrimary Dust Explosion"]
[null,"  *Each Loss Event represents separate Scenarios"]

{"sheet":"Source Models","index":4,"n_rows":78,"n_cols":36,"rows_kept":78,"cut":false,"hidden":false,"merged":[[8,0,8,9],[4,4,4,7],[60,19,60,24],[2,28,2,29],[1,27,2,27],[11,4,11,5],[37,4,37,5],[1,12,1,15],[27,12,27,15],[1,19,1,24],[7,19,7,24],[35,19,35,24],[22,3,22,7],[23,2,23,8],[46,2,46,3]]}
[]
[null,null,null,null,"SOURCE MODELS INPUT INFORMATION",null,null,null,null,null,null,null,"ESTIMATED VAPOR RELEASE RATE",null,null,null,null,null,null,"LIQUID RELEASE - ESTIMATED FLASH FRACTION",null,null,null,null,null,null,null,"Conversion Factors"]
[null,null,null,"Required Inputs are Shaded \"Yellow\"",null,null,null,null,null,null,null,null,null,null,null,null,null,null,null,null,null,null,null,null,null,null,null,null,"Conversion Table",null,null,"VaporList",null,"Chemical Properties:"]
[null,null,null,null,null,null,null,null,null,null,null,"Hole Size (equation 12-4):",null,null,null,null,null,null,null,"Flash Fraction (equation 12-24), Fv = CS ( T-TB ) / DHV",null,null,null,{"$f":"\" = ( \"&ROUND(H33,2)&\" ) ( \"&H17&\" - \"&H29&\" ) / ( \"&ROUND(H34,1)&\" )\"","v":" = ( 0 ) ( 0 - 0 ) / ( 0 )"},null,null,null,{"$f":"IF(F18<>\"\",VLOOKUP(F18,Conversion_Table,2,0),1)","v":1},"mm",1E-3,null,"Hole Size",null,"Mol Weight",{"$f":"IF(Chemical=\"\",\"\",VLOOKUP(Chemical,Chemical_Table,COLUMN('Chemical Table'!C1),FALSE))","v":""}]
[null,"STEP 1 - Select Type of Release",null,null,null,null,null,null,null,null,null,"V = 23 cd d2 P0 { [ (PA/P0)1.429- (PA/P0)1.714] Mw / T }1/2  based on 1.4 isentropic exponent",null,null,null,null,null,null,null,"Fv =",{"$f":"IF(AND(E5<>\"Heat with Vaporization\",$H$27=\"Liquid\"),IF(H34>0,IF(H17>H29,IF(H33*(H17-H29)/H34<0.999999,ROUND(H33*(H17-H29)/H34,3),0.999999),0.000001),0.000001),0)","v":0},null,null,"Initial Fraction Vapor = ",{"$f":"IF(OR(E5=\"\",E5=\"Heat with Vaporization\",H27=\"Vapor\",U5=0),0,IF(E5=\"Equipment Rupture\",U5*H19/W70,U5*IF(E5=\"Short Pipe-Flashing Liquid\",M41,IF(E5=\"Specified Rate\",M45,M33))/W64))","v":0},null,null,{"$f":"IF(F19<>\"\",VLOOKUP(F19,Conversion_Table,2,0),1)","v":1},"cm",0.01,null,"Specified Rate"]
[null,null,null,null,{"$f":"IF(H27=\"\",\"Options for Type of Release will Change Depending on Physical State from Step 3\",\"\")","v":"Options for Type of Release will Change Depending on Physical State from Step 3"},null,null,null,null,null,null,"PA / P0 = ",{"$f":"IF(101.3/(H18+101.3)<0.528,0.528,ROUND(101.3/(H18+101.3),3))","v":1},{"$f":"IF(101.3/(H18+101.3)<0.528,\" limited to 0.528\",\"\")","v":""},null,"Note: PA = 101.3 kPa",null,null,null,null,null,null,null,null,null,null,null,{"$f":"IF(F31<>\"\",VLOOKUP(F31,Conversion_Table,2,0),1)","v":1},"m",1,null,"10 Minute Release",null,"Estimated Boiling Pt",{"$f":"IF(Chemical=\"\",\"\",ROUND(AI14/AI13+AI15-273.15,1))","v":""},"C"]
[null,null,null,null,{"$f":"IF(H27=\"\",\"\",IF(AND(H27=\"Liquid\",H18>=50,H31/(101.325+H18)>0.9,E5=\"Hole Size\"),\"Consider Release Type as 'Short Pipe-Flashing Liquid' for Pipe or Hose Failure Cases\",IF(AND(H27=\"Liquid\",H18>=50,H31/(101.325+H18)<0.9,E5=\"Short Pipe-Flashing Liquid\"),\"Release Temperature Needs to be Much Higher than the Normal Boiling Point to be Considered 'Flashing Liquid'\",\"\"\"\")))","v":""},null,null,null,null,null,null,{"$f":"\"  V = 23 \"&\"( \"&H12&\" )\"&\" ( \"&ROUND(H11,3)&\" )^2 \"&\" ( \"&ROUND(101.3+H18,2)&\" ) { ( \"&ROUND(M6,3)&\" )^1.429 - ( \"&ROUND(M6,3)&\" )^1.714 } ( \"&H28&\" ) / ( \"&H17+273.15&\" )}^1/2 =\"","v":"  V = 23 ( 0.61 ) ( 0 )^2  ( 101.3 ) { ( 1 )^1.429 - ( 1 )^1.714 } ( 0 ) / ( 273.15 )}^1/2 ="},null,null,null,null,null,null,null,null,null,null,null,null,null,null,null,{"$f":"IF(F32<>\"\",VLOOKUP(F32,Conversion_Table,2,0),1)","v":1},"in",2.5399999999999999E-2,null,"Equipment Rupture",null,{"$f":"\"Chemical Properties at Release Temperature of \"&H17&\" C\"","v":"Chemical Properties at Release Temperature of 0 C"}]
[null,"STEP 2 -  Enter Required Release Information",null,null,null,null,null,null,null,null,null,"V = ",{"$f":"IF(AND($H$27=\"Vapor\",$E$5=\"Hole Size\"),ROUND(23*H12*H11^2*(101.3+H18)*((M6^1.429-M6^1.714)*H28/(273.15+H17))^0.5,3-LOG10(23*H12*H11^2*(101.3+H18)*((M6^1.429-M6^1.714)*H28/(273.15+H17))^0.5)),0)","v":0}," kg/sec",{"$f":"\"- or -\"","v":"- or -"},{"$f":"IF(M8>0,ROUND(132*M8,2-LOG10(132*M8)),0)","v":0}," lb/min",null,null,"LIQUID RELEASE - ESTIMATED AEROSOL FRACTION",null,null,null,null,null,null,null,{"$f":"IF(F33<>\"\",VLOOKUP(F33,Conversion_Table,2,0),1)","v":1},"ft",0.30480000000000002,null,null,null,"Vapor Pressure, Psat",{"$f":"IF(Chemical=\"\",0,ROUND(101.325*EXP(AI13-AI14/(H17+273.15-AI15)),1))","v":0},"kPa absolute"]
["Input Units may be changed - Input Values in \"blue\" will be converted to appropriate equation units",null,null,null,null,null,null,null,null,null,"  1 hr Release =",null,{"$f":"IF(E$19=\"\",ROUND(M8*3600,1),IF(M8*3600<H$19,ROUND(M8*3600,1),H$19))","v":0}," kg",{"$f":"\"- or -\"","v":"- or -"},{"$f":"ROUND(2.2*M9,1)","v":0}," lb",null,null,null,null,null,null,null,null,null,null,{"$f":"IF(F34<>\"\",VLOOKUP(F34,Conversion_Table,2,0),1)","v":1},"liter",1E-3,null,"LiquidList",null,"Liquid Density, rL",{"$f":"IF(Chemical=\"\",0,IF(1000*(AI17-AI18*H17)>2*P38,ROUND(1000*(AI17-AI18*H17),1),2*P38))","v":0},"kg/cu m"]
[null,"Release Inputs:",null,null,"Input Value","Input Units",null,"Equation Input"," Equation Units",null,null,null,null,null,null,null,null,null,null,null,null,null,null,null,null,null,null,{"$f":"IF(F39<>\"\",VLOOKUP(F39,Conversion_Table,2,0),1)","v":1},"gal",3.7854120000000002E-3,null,"Hole Size",null,"Liquid Heat Capacity, CS",{"$f":"IF(Chemical=\"\",0,ROUND(4.1868*(AI20+AI21*H17),3))","v":0},"kJ/kg C"]
[null,null,"Hole Size, d",null,null,null,null,{"$f":"IF(AND($H$27=\"Liquid\",H14>0,H18>0,E11=\"\"),AF21,E11*AB14)","v":0},"m",null,null,"Specified Rate:",null,null,null,null,null,null,null,"  Selected Liquid Release Rate, L = ",null,null,{"$f":"IF(E5=\"Short Pipe-Flashing Liquid\",M41,IF(E5=\"Specified Rate\",M45,IF(E5=\"Equipment Rupture\",0,M33)))","v":0}," kg/sec",null,null,null,{"$f":"IF(F41<>\"\",VLOOKUP(F41,Conversion_Table,2,0),1)","v":1},"cu ft",2.8316850000000001E-2,null,"Short Pipe-Flashing Liquid",null,"Heat of Vaporization, DHV",{"$f":"IF(Chemical=\"\",0,IF(4.1868*(AI23-AI24*H17-AI25*H17*H17)>50,ROUND(4.1868*(AI23-AI24*H17-AI25*H17*H17),1),50))","v":0},"kJ/kg"]
[null,null,"  Coefficient cd  (typically Square Edged Hole)",null,"Sharp- Edged Hole",null,null,{"$f":"IF(E12=\"Rounded Nozzle\",1,IF(E12=\"Short Pipe L/D<3\",0.81,0.61))","v":0.61}," dimensionless",null,null,"V = ",{"$f":"IF(AND($H$27=\"Vapor\",$E$5=\"Specified Rate\"),H14,0)","v":0}," kg/sec",{"$f":"\"- or -\"","v":"- or -"},{"$f":"IF(M12>0,ROUND(132*M12,2-LOG10(132*M12)),0)","v":0}," lb/min",null,null,null,null,null,null,null,null,null,null,{"$f":"IF(F42<>\"\",VLOOKUP(F42,Conversion_Table,2,0),1)","v":1},"cu m",1,null,"Heat with Vaporization",null,null,null,"Alternate VP"]
[null,null,"Heat Input Rate, q",null,null,null,null,{"$f":"E13*AB15","v":0},"kWatt",null,"  1 hr Release =",null,{"$f":"IF(E$19=\"\",ROUND(M12*3600,1),IF(M12*3600<H$19,ROUND(M12*3600,1),H$19))","v":0}," kg",{"$f":"\"- or -\"","v":"- or -"},{"$f":"ROUND(2.2*M13,1)","v":0}," lb",null,null,"   Flashing Fluid Density, r' = 1 / [ Fv / rV + ( 1 - Fv ) / rL ] =",null,null,null,null,null,null,null,{"$f":"IF(F43<>\"\",VLOOKUP(F43,Conversion_Table,2,0),1)","v":1},"sq m",1,null,"Specified Rate",null,"Vapor Pressure A",{"$f":"VLOOKUP(Chemical,Chemical_Table,COLUMN('Chemical Table'!AE1),FALSE)","v":{"$error":"#N/A"}},{"$f":"AJ14/(H29+273.15)","v":0}]
[null,null,"Specified Rate  (at either specified Hole",null,null,null,null,{"$f":"ROUND(IF(AND(E19>0,$E$5=\"10 Minute Release\"),H19/600,E14*AB16),4)","v":0},"kg/sec",null,null,null,null,null,null,null,null,null,null,null,null,null,{"$f":"IF(E5=\"Short Pipe-Flashing Liquid\",\"1 / [ \"&ROUND(U5,3)&\" / \"&P38&\" + ( 1 - \"&ROUND(U5,3)&\" ) / \"&H32&\" ] =\",\"\")","v":""},{"$f":"IF($H$27=\"Liquid\",IF(OR(H32=0,P38=0,E5<>\"Short Pipe-Flashing Liquid\"),H32,ROUND(1/(U5/P38+(1-U5)/H32),1)),0)","v":0}," kg/m3",null,null,{"$f":"IF(F11<>\"\",VLOOKUP(F11,Conversion_Table,2,0),1)","v":1},"sq ft",9.2903040000000006E-2,null,"10 Minute Release",null,"Vapor Pressure B",{"$f":"VLOOKUP(Chemical,Chemical_Table,COLUMN('Chemical Table'!AF1),FALSE)","v":{"$error":"#N/A"}},{"$f":"H34*H28/8.3145","v":0}]
[null,null,"       Size or Release Pressure)",{"$f":"IF(AND($H$27=\"Liquid\",H14>0,H18>0,H11>0,ABS(E18-AF24)>0.1),\"Mismatch in Hole Size and Pressure Inputs, Equivalent Release Pressure = \"&ROUND(AF24,3)&\" kPa\",IF(AND($H$27=\"Liquid\",H14>0,H18=0,H11>0),\"                    Equivalent Release Pressure = \"&ROUND(AF24,3)&\" kPa\",IF(AND($H$27=\"Liquid\",H14>0,H18>0,H11>0),\"               Equivalent Hole Diameter at Specified Liquid Rate = \"&ROUND(AF21,3)&\" m\",0)))","v":0},null,null,null,null,null,null,null,"Heat Input with Vaporization (equations 12-12 to 12-15):",null,null,null,null,null,null,null,null,null,null,null,null,null,null,null,{"$f":"IF(F13<>\"\",VLOOKUP(F13,Conversion_Table,2,0),1)","v":1},"atm",101.325,null,"Equipment Rupture",null,"Vapor Pressure C",{"$f":"VLOOKUP(Chemical,Chemical_Table,COLUMN('Chemical Table'!AG1),FALSE)","v":{"$error":"#N/A"}},0]
[null,"Process Inputs:",null,null,"Input Value","Input Units",null,"Equation Input"," Equation Units",null,null,"V = q / DHV ",{"$f":"\" = ( \"&ROUND(H13,2)&\" ) / ( \"&ROUND(H34,2)&\" )\"","v":" = ( 0 ) / ( 0 )"},null,null,null,null,null,null,"Liquid or Two-Phase Release Velocity (equation 12-8),  vd = 1.27 L / [ d2  cd  r' ] = ",null,null,null,null,null,null,null,{"$f":"IF(F14<>\"\",VLOOKUP(F14,Conversion_Table,2,0),1)","v":1},"bar",100]
[null,null,"Release Temperature, T",null,null,null,null,{"$f":"IF(F17=\"F\",ROUND((E17-32)/1.8,1),E17)","v":0},"C",null,null,"V = ",{"$f":"IF(AND($E$5=\"Heat with Vaporization\",H34>0),ROUND(H13/H34,3-LOG10(H13/H34)),0)","v":0}," kg/sec",{"$f":"\"- or -\"","v":"- or -"},{"$f":"IF(M17>0,ROUND(132*M17,2-LOG10(132*M17)),0)","v":0}," lb/min",null,null,null,null,"or  vd = 1.524 [ 1000 (P0 - PA) / r' + 9.8 h' ]0.5 =",null,null,null,null,null,null,"kPa",1,null,"Liquid or two-phase release velocity for hole size",null,"Liquid Density A",{"$f":"VLOOKUP(Chemical,Chemical_Table,COLUMN('Chemical Table'!X1),FALSE)","v":{"$error":"#N/A"}}]
[null,null,"Release Pressure (gauge), P0 - PA",null,null,null,null,{"$f":"E18*AB4","v":0},"kPa gauge",null,"  1 hr Release =",null,{"$f":"IF(M17=\"\",\"\",IF(E$19=\"\",ROUND(M17*3600,1),IF(M17*3600<H$19,ROUND(M17*3600,1),H$19)))","v":0}," kg",{"$f":"\"- or -\"","v":"- or -"},{"$f":"IF(M18=\"\",\"\",ROUND(2.2*M18,1))","v":0}," lb",null,null,null,null,null,{"$f":"IF(E5=\"Equipment Rupture\",\"1.524 [ 1000 ( \"&ROUND(H18,1)&\" ) / \"&ROUND(X14,1)&\" + 9.8 ( \"&H41&\" ) ]^0.5 =\",\"1.27 ( \"&W11&\" ) / [ ( \"&ROUND(H11,3)&\" )^2 ( \"&IF(E5=\"Short Pipe-Flashing Liquid\",1,H12)&\" ) ( \"&X14&\" ) ] =\")","v":"1.27 ( 0 ) / [ ( 0 )^2 ( 0.61 ) ( 0 ) ] ="},{"$f":"IF(OR(AND(H11=0,$E$5<>\"10 Minute Release\",$E$5<>\"Equipment Rupture\"),H27<>\"Liquid\"),0,IF(H11=\"\",0,IF(OR($E$5=\"10 Minute Release\",$E$5=\"Equipment Rupture\"),AF18,1.27*W11/(IF(E5=\"Short Pipe-Flashing Liquid\",1,H12)*H11^2*X14))))","v":0}," m/sec",null,null,null,"psi",6.8947566644743317,null,{"$f":"IF(H27=\"Liquid\",1.524*(1000*H18/X14+9.8*H41)^0.5,0)","v":0},null,"Liquid Density B",{"$f":"VLOOKUP(Chemical,Chemical_Table,COLUMN('Chemical Table'!Y1),FALSE)","v":{"$error":"#N/A"}}]
[null,null,"Total Inventory (Leave Blank for 1 hour leak)",null,null,null,null,{"$f":"IF(E19=\"\",\"\",ROUND(E19*AB5,2))","v":""},"kg",null,null,null,null,null,null,null,null,null,null,null,null,null,null,null,null,null,null,null,"mmHg",0.1333234305036673]
[null,null,null,{"$f":"IF(E5=\"Equipment Rupture\",\"Inventory Must be Entered for Equipment Rupture\",\"\")","v":""},{"$f":"IF(AND(H17<20,H29>25),\"Release of very cold liquid, consider increasing 'apparent' Release Temperature to near ambient\",\"\")","v":""},null,null,null,null,null,null,"10 Minute Release:",null,null,null,null,null,null,null,"Estimated Droplet Diameter (equation 12-26), dd = 170 (1 - FV) /  vd2  = ",null,null,null,null,null,null,null,null,"kWatt",1,null,"Equivalent Hole Size for Specified Rate",null,"Liquid Heat Capacity A",{"$f":"VLOOKUP(Chemical,Chemical_Table,COLUMN('Chemical Table'!Z1),FALSE)","v":{"$error":"#N/A"}}]
[null,"STEP 3 - Enter Chemical Properties (or Select Chemical Name from Pic List)",null,null,null,null,null,null,null,null,null,"V = ",{"$f":"IF(AND(H27=\"Vapor\",E5=\"10 Minute Release\"),ROUND(H19/600,3-LOG10(H19/600)),0)","v":0}," kg/sec",{"$f":"\"- or -\"","v":"- or -"},{"$f":"IF(M21>0,ROUND(132*M21,2-LOG10(132*M21)),0)","v":0}," lb/min",null,null,null,null,null,{"$f":"\"170 ( 1 - \"&ROUND(U5,3)&\" ) /  \"&ROUND(X18,1)&\"^2 =\"","v":"170 ( 1 - 0 ) /  0^2 ="},{"$f":"IF(OR(X18<0.1,H27<>\"Liquid\"),0,IF(170*(1-U5)/X18^2<10,170*(1-U5)/X18^2,10))","v":0}," mm",null,null,null,"kcal/sec",4.1867999999999999,null,{"$f":"IF(AND($H$27=\"Liquid\",H18>0),(H14/(1.2*H12*(H32*(1000*H18+9.8*H32*H41))^0.5))^0.5,0)","v":0},null,"Liquid Heat Capacity B",{"$f":"VLOOKUP(Chemical,Chemical_Table,COLUMN('Chemical Table'!AA1),FALSE)","v":{"$error":"#N/A"}}]
[null,null,null,null,null,null,null,null,"Cas No.",null,"  1 hr Release =",null,{"$f":"IF(AND(H27=\"Vapor\",E5=\"10 Minute Release\"),H19,0)","v":0}," kg",{"$f":"\"- or -\"","v":"- or -"},{"$f":"IF(M22=\"\",\"\",ROUND(2.2*M22,1))","v":0}," lb",null,null,null,null,null,null,{"$f":"IF(H27=\"Vapor\",0,IF(AND(H27=\"Liquid\",X18<4),\"Limited to 10 mm droplet diameter\",IF(170*(1-U5)/X18^2>10,\"Limited to 10 mm droplet diameter\",\"\")))","v":{"$error":"#DIV/0!"}},null,null,null,null,"HP",0.74570000000000003]
[null,null,"Chemical Name",null,null,null,null,null,{"$f":"IF(Chemical=\"\",\"\",VLOOKUP(Chemical,Chemical_Table,COLUMN('Chemical Table'!B1),FALSE))","v":""},null,null,null,null,null,null,null,null,null,null,"Liquid Spray Distance (equation 12-7), s = vd t = 0.45 vd h1/2 =",null,null,null,null,null,null,null,null,"BTU/hr",2.9281000000000001E-4,null,"Equivalent Pressure for Specified Rate",null,"Heat of Vaporization A",{"$f":"VLOOKUP(Chemical,Chemical_Table,COLUMN('Chemical Table'!AB1),FALSE)","v":{"$error":"#N/A"}}]
[null,null,null,null,null,null,null,null,null,null,null,"Equipment Rupture:",null,null,null,null,null,null,null,null,null,{"$f":"\"0.45 ( \"&ROUND(X18,2)&\" ) ( \"&H43&\" )^0.5 = \"","v":"0.45 ( 0 ) ( 1 )^0.5 = "},{"$f":"IF(X18>0,0.45*X18*H43^0.5,\"\")","v":""}," m    - or -",{"$f":"IF(W24<>\"\",3.28*W24,\"\")","v":""}," ft",null,null,"kcal/min",251.208,null,{"$f":"IF(AND($H$27=\"Liquid\",H11>0),((E14/(1.2*H12*H11^2))^2-9.8*H32*H41)/(1000*H32),0)","v":0},null,"Heat of Vaporization B",{"$f":"VLOOKUP(Chemical,Chemical_Table,COLUMN('Chemical Table'!AC1),FALSE)","v":{"$error":"#N/A"}}]
[null,null,null,null,"(Leave Input Value Blank to accept Chemical Data Table Values)",null,null,null,null,null,null,"Total Release = ",{"$f":"IF(OR(D27<>\"Vapor\",E5<>\"Equipment Rupture\"),0,IF(E$19=\"\",ROUND(0.12*H39*H28*(101.3+H18)/(273.15+H17),2),H19))","v":0}," kg",{"$f":"\"- or -\"","v":"- or -"},{"$f":"ROUND(2.2*M25,1)","v":0}," lb",null,null,null,null,null,null,null,null,null,null,null,"kwatt /sq m C",1,null,null,null,"Heat of Vaporization C",{"$f":"VLOOKUP(Chemical,Chemical_Table,COLUMN('Chemical Table'!AD1),FALSE)","v":{"$error":"#N/A"}}]
[null,null,null,"Data Table Value","Input Value","Input Units",null,"Equation Input"," Equation Units",null,null,null,null,null,null,null,null,null,null,"Aerosol Temperature (equation 12-28):",null,null,null,null,null,null,null,null,"kcal/hr sq m C",1.1620000000000001E-3,null,"total liquid release quantity"]
[null,null,"Physical State",{"$f":"IF(Chemical=\"\",\"\",IF(H31>H18+101.325,\"Vapor\",\"Liquid\"))","v":""},null,null,null,{"$f":"IF(E27=\"\",D27,E27)","v":""},null,null,null,null,null,null,null,null,null,null,null,"T' = { 7.9 vd2 h'0.5 Ud TAmb / [rL (1-FV) ] + CS T - FD DHV } / { 7.9 vd2 h'0.5 Ud / [ rL (1-FV) ] + CS }",null,null,null,null,null,null,null,null,"BTU/hr sq ft F",5.6782600000000001E-3,null,{"$f":"IF(E5=\"Short Pipe-Flashing Liquid\",M42,IF(E5=\"Specified Rate\",M46,IF(E5=\"Equipment Rupture\",M49,M34)))","v":0},null,"Ambient  Temperature ",25,"C"]
[null,null,"Molecular Weight, Mw",{"$f":"AI4","v":""},null,null,null,{"$f":"IF(AND(D28=\"\",E28=\"\"),0,IF(E28=\"\",D28,E28))","v":0},null,null,null,null,"ESTIMATED LIQUID RELEASE RATE",null,null,null,null,null,null,null,null,"Aerosol Temperature, T' = ",{"$f":"IF($H$27=\"Liquid\",ROUND(AI48,2),0)","v":0},{"$f":"\" C    ( \"&W28+273.15&\"  K )\"","v":" C    ( 273.15  K )"},null,null,null,null,"kg/cu m",1,null,null,null,"Daytime Solar Radiation",0.5,"kW/m2"]
[null,null,"Normal Boiling Point, TB",{"$f":"IF(Chemical=\"\",\"\",IF(F29=\"F\",ROUND((1.8*AI6+32),1),AI6))","v":""},null,null,null,{"$f":"IF(AND(D29=\"\",E29=\"\"),0,IF(F29=\"F\",ROUND((IF(E29=\"\",D29,E29)-32)/1.8,1),IF(E29=\"\",D29,E29)))","v":0},"C",null,null,null,null,null,null,null,null,null,null,null,null,"Vapor Pressure at Aerosol Temp, Psat = ",{"$f":"IF($H$27=\"Liquid\",AI49,0)","v":0},"  kPa",null,null,null,null,"g/ml",1000,null,null,null,"Heat Loss Coefficient, UD",{"$f":"IF(AI27>H29,0.2,0.02)","v":0.2},"kW/m2 K"]
[null,"Liquid Properties at Release Temperature:",null,null,null,null,null,null,null,null,null,"Hole Size - Subcooled Liquid (equation 12-5):",null,null,null,null,null,null,null,null,null,null,null,null,null,null,null,null,"g/liter",1,null,null,null,"Heat Loss Coefficient, UGnd",{"$f":"IF(AI27>H29,0.2,0.02)","v":0.2},"kW/m2 K"]
[null,null,"Vapor Pressure, Psat",{"$f":"IF(F31<>\"\",ROUND(AI8/AB6,4),AI8)","v":0},null,null,null,{"$f":"IF(AND(E31=\"\",D31=\"\"),0,IF(E31=\"\",D31*AB6,E31*AB6))","v":0}," kPa absolute",null,null,"L = 1.1 cd d2 { rL [ 1000 (P0 - PA) + 9.8 rL h' ] }1/2   Bernoulli equation",null,null,null,null,null,null,null,"Aerosol Fraction (equation 12-27), FD = 0.043 vd2 Mw2/3 Psat h1/2 / [ rL T' ( 1 - Fv ) ] =",null,null,null,null,null,null,null,null,"lb/cu ft",16.018460000000001]
[null,null,"Liquid Density, rL",{"$f":"IF(H27=\"Vapor\",\"\",IF(F32<>\"\",ROUND(AI9/AB7,3),AI9))","v":0},null,null,null,{"$f":"IF(AND(E32=\"\",D32=\"\"),0,IF(E32=\"\",ROUND(D32*AB7,1),ROUND(E32*AB7,1)))","v":0},"kg/cu m",null,null,{"$f":"\"L = 1.1 \"&\"( \"&H12&\" )\"&\" ( \"&ROUND(H11,3)&\" )^2 \"&\" { ( \"&H32&\" ) { [ 1000 ( \"&ROUND(H18,2)&\" ) +  9.8 ( \"&H32&\" ) ( \"&H41&\" ) ] }^1/2 =\"","v":"L = 1.1 ( 0.61 ) ( 0 )^2  { ( 0 ) { [ 1000 ( 0 ) +  9.8 ( 0 ) ( 0 ) ] }^1/2 ="},null,null,null,null,null,null,null,{"$f":"\"0.043 ( \"&IF(X18>4,ROUND(X18,2),4)&\" )^2  ( \"&H28& \" )^2/3  ( \"&ROUND(W29,3)&\" ) ( \"&H43&\" )^1/2  / [ \"&H32&\" ( 273.15 + \"&W28&\" ) ( 1 - \"&ROUND(U5,3)&\" ) ]\"","v":"0.043 ( 4 )^2  ( 0 )^2/3  ( 0 ) ( 1 )^1/2  / [ 0 ( 273.15 + 0 ) ( 1 - 0 ) ]"},null,null,null,null,null,null,null,null,"lb/gal",119.83000000000001,null,null,null,"Aerosol Temperature - Trial and Error"]
[null,null,"Liquid Heat Capacity, CS",{"$f":"IF(H27=\"Vapor\",\"\",IF(F33<>\"\",ROUND(AI10/AB8,3),AI10))","v":0},null,null,null,{"$f":"IF(AND(E33=\"\",D33=\"\"),0,IF(E33=\"\",D33*AB8,E33*AB8))","v":0},"kJ/kg C",null,null,"L = ",{"$f":"IF(AND(H27=\"Liquid\",$E$5=\"10 Minute Release\"),ROUND(H19/600,3-LOG(H19/600)),IF(AND($H$27=\"Liquid\",$E$5=\"Hole Size\",$E$18>0),ROUND(1.1*H12*H11^2*(H32*(1000*H18+9.8*H32*H41))^0.5,3-LOG10(1.1*H12*H11^2*(H32*(1000*H18+9.8*H32*H41))^0.5)),0))","v":0}," kg/sec",{"$f":"\"- or -\"","v":"- or -"},{"$f":"IF(M33>0,ROUND(132*M33,2-LOG10(132*M33)),0)","v":0}," lb/min",null,null,"FD =",{"$f":"IF(X14=0,0,IF(U5<1,IF(0.043*IF(X18<4,4,X18)^2*H28^0.667*W29*H43^0.5/(H32*(273.15+W28)*(1-U5))>1,1,ROUND(0.043*IF(X18<4,4,X18)^2*H28^0.667*W29*H43^0.5/(H32*(273.15+W28)*(1-U5)),4)),0))","v":0},{"$f":"IF(X18<4,\"  Limited to minimum droplet diameter of 10 mm or velocity of 4 m/sec\",\"\")","v":"  Limited to minimum droplet diameter of 10 mm or velocity of 4 m/sec"},null,null,null,null,null,null,"kcal/kg C",4.1839988820354987,null,null,null,"Temperature - Trial 1",{"$f":"IF($H$27=\"Liquid\",IF(H17<H29,H17,H29),0)","v":0},"C"]
[null,null,"Heat of Vaporization, DHV",{"$f":"IF(F34<>\"\",ROUND(AI11/AB9,1),AI11)","v":0},null,null,null,{"$f":"IF(AND(E34=\"\",D34=\"\"),0,IF(E34=\"\",D34*AB9,E34*AB9))","v":0},"kJ/kg",null,null,"1 hr Release = ",{"$f":"IF(E$19=\"\",ROUND(M33*3600,1),IF(M33*3600<H$19,ROUND(M33*3600,1),H$19))","v":0}," kg",{"$f":"\"- or -\"","v":"- or -"},{"$f":"ROUND(2.2*M34,1)","v":0}," lb",null,null,null,null,null,null,null,null,null,null,null,"cal/g C",4.1839988820354987,null,null,null,"Vapor Pressure - Trial 1",{"$f":"IF($H$27=\"Liquid\",IF(Chemical=\"\",101.325*EXP(AJ$13-AJ$14/(AI33+273.15)),101.325*EXP(AI$13-AI$14/(AI33+273.15-AI$15))),0)","v":0},"kPa"]
[null,null,null,null,null,null,null,null,null,null,null,null,null,null,null,null,null,null,null,null,null,null,null,null,null,null,null,null,"kJ/kg C",1,null,null,null,"Aerosol Fraction - Trial 1",{"$f":"IF(X$14=0,0,IF(U$5<1,IF(0.043*IF(X$18<4,4,X$18)^2*H$28^0.667*AI34*H$43^0.5/(H$32*(273.15+AI33)*(1-U$5))>1,1,ROUND(0.043*IF(X$18<4,4,X$18)^2*H$28^0.667*AI34*H$43^0.5/(H$32*(273.15+AI33)*(1-U$5)),4)),0))","v":0}]
[null,"STEP 4 - Enter Equipment and Plant Layout Information",null,null,null,null,null,null,null,null,null,"Hole Size - Flashing Saturated Liquid (equation 12-6 for path length > 0.1 m):",null,null,null,null,null,null,null,"LIQUID RELEASE - ESTIMATED POOL EVAPORATION",null,null,null,null,null,null,null,null,"J/g C",1,null,null,null,"Temperature - Trial 2",{"$f":"(MIN(H$29,(7.9*X$18^2*H$43^0.5*AI$29*(AI$27+273.15)/(H$32*(1-U$5))+H$33*(H$17+273.15)-AI35*H$34)/(7.9*X$18^2*H$43^0.5*AI$29/(H$32*(1-U$5))+H$33)-273.15)+AI33)/2","v":{"$error":"#DIV/0!"}},"C"]
[null,null,null,null,"Input Value","Input Units",null,"Equation Input"," Equation Units",null,null,"Vapor Density (equation 10-16), ",null," rV = 0.12 P Mw / T   as ideal gas at release pressure",null,null,null,null,null,null,null,null,null,null,null,null,null,null,"BTU/lb F",4.1839988820354987,null,null,null,"Vapor Pressure - Trial 2",{"$f":"IF($H$27=\"Liquid\",IF(Chemical=\"\",101.325*EXP(AJ$13-AJ$14/(AI36+273.15)),101.325*EXP(AI$13-AI$14/(AI36+273.15-AI$15))),0)","v":0},"kPa"]
[null,null,"Equipment Location",null,null,null,"(Assumed Outdoor if Blank)",null,null,null,null,null,null,null,{"$f":"\" = 0.12 ( \"&ROUND(101.3+H18,1)&\" ) ( \"&H28&\" ) / ( \"&273.15+H17&\" )  =\"","v":" = 0.12 ( 101.3 ) ( 0 ) / ( 273.15 )  ="},{"$f":"ROUND(0.12*(101.3+H18)*H28/(273.15+H17),2)","v":0},"Kg/m3",null,null,null,null,null,null,null,null,null,null,null,"kJ/kg",1,null,null,null,"Aerosol Fraction - Trial 2",{"$f":"IF(X$14=0,0,IF(U$5<1,IF(0.043*IF(X$18<4,4,X$18)^2*H$28^0.667*AI37*H$43^0.5/(H$32*(273.15+AI36)*(1-U$5))>1,1,ROUND(0.043*IF(X$18<4,4,X$18)^2*H$28^0.667*AI37*H$43^0.5/(H$32*(273.15+AI36)*(1-U$5)),4)),0))","v":0}]
[null,null,"Equipment Volume, VEquip",null,null,null,null,{"$f":"E39*AB10","v":0},"cu m",null,null,"L = 25 d2 { DHV / [ ( 1 / rV ) - ( 1 / rL ) ] } / [ CS T ]1/2",null,null,null,null,null,null,null,"Release Duration, tL = Inventory / L = ",null,null,{"$f":"H19&\" / \"&W11&\" = \"","v":" / 0 = "},{"$f":"IF(W11>0,IF(H19=\"\",3600,IF(H19/W11>3600,3600,ROUND(H19/W11,2))),0)","v":0}," sec",null,null,null,"cal/g",4.1839988820354987,null,null,null,"Temperature - Trial 3",{"$f":"(MIN(H$29,(7.9*X$18^2*H$43^0.5*AI$29*(AI$27+273.15)/(H$32*(1-U$5))+H$33*(H$17+273.15)-AI38*H$34)/(7.9*X$18^2*H$43^0.5*AI$29/(H$32*(1-U$5))+H$33)-273.15)+AI36)/2","v":{"$error":"#DIV/0!"}},"C"]
[null,null,"Estimated Contained Mass  (for Reference if volume and density entered)",null,null,null,null,{"$f":"H39*H32","v":0},"kg",null,null,{"$f":"\"  = 25 ( \"&ROUND(H11,3)&\" )^2  { ( \"&ROUND(H34,1)&\" ) / [ ( 1 / \"&P38&\" ) +  ( 1 / \"&H32&\" ) ] }  /  [ ( \"&ROUND(H33,2)&\" ) ( \"&273.15+H17&\" ) ]^1/2 =\"","v":"  = 25 ( 0 )^2  { ( 0 ) / [ ( 1 / 0 ) +  ( 1 / 0 ) ] }  /  [ ( 0 ) ( 273.15 ) ]^1/2 ="},null,null,null,null,null,null,null,null,null,null,{"$f":"IF(AND(H19<>\"\",W11>0),IF(H19/W11>3600,\"Release Duration Greater than 1 Hour - will be limited to 1 hour\",\"\"),\"\")","v":""},null,null,null,null,null,"J/g",1,null,null,null,"Vapor Pressure - Trial 3",{"$f":"IF($H$27=\"Liquid\",IF(Chemical=\"\",101.325*EXP(AJ$13-AJ$14/(AI39+273.15)),101.325*EXP(AI$13-AI$14/(AI39+273.15-AI$15))),0)","v":0},"kPa"]
[null,null,"Liquid Height within Equipment, h'",null,null,null,null,{"$f":"E41*AB11","v":0},"m",null,null,"L = ",{"$f":"IF($E$5=\"Short Pipe-Flashing Liquid\",IF(OR(H29>H17,H32=0,H33=0),0,ROUND(25*H11^2*(H34/(1/P38-1/H32))/((H33*(273.15+H17))^0.5),3-LOG10(25*H11^2*(H34/(1/P38-1/H32))/((H33*(273.15+H17))^0.5)))),0)","v":0}," kg/sec",{"$f":"\"- or -\"","v":"- or -"},{"$f":"IF(M41>0,ROUND(132*M41,2),0)","v":0}," lb/min",null,null,"Estimated Liquid Rate to Pool, L' = L ( 1 - Fv ) ( 1 - FD ) =",null,null,null,null,null,null,null,null,"kcal/kg",4.1839988820354987,null,null,null,"Aerosol Fraction - Trial 3",{"$f":"IF(X$14=0,0,IF(U$5<1,IF(0.043*IF(X$18<4,4,X$18)^2*H$28^0.667*AI40*H$43^0.5/(H$32*(273.15+AI39)*(1-U$5))>1,1,ROUND(0.043*IF(X$18<4,4,X$18)^2*H$28^0.667*AI40*H$43^0.5/(H$32*(273.15+AI39)*(1-U$5)),4)),0))","v":0}]
[null,null,"Diked Area  (Leave Blank if No Dike)",null,null,null,null,{"$f":"IF(E42=\"\",\"No Dike\",ROUND(E42*AB12,3-LOG(E42*AB12)))","v":"No Dike"},"sq m",null,null,"1 hr Release = ",{"$f":"IF(E$19=\"\",ROUND(M41*3600,1),IF(M41*3600<H$19,ROUND(M41*3600,1),H$19))","v":0}," kg",{"$f":"\"- or -\"","v":"- or -"},{"$f":"IF(M42=\"\",\"\",ROUND(2.2*M42,1))","v":0}," lb",null,null,null,null,null,{"$f":"W11&\" ( 1 - \"&U5&\" ) ( 1 - \"&U33&\" ) =\"","v":"0 ( 1 - 0 ) ( 1 - 0 ) ="},{"$f":"IF(AND(W11>0,U33<1),ROUND(W11*(1-U5)*(1-U33),4),0)","v":0}," kg/sec",null,null,null,"BTU/lb",2.3244438233530551,null,null,null,"Temperature - Trial 4",{"$f":"(MIN(H$29,(7.9*X$18^2*H$43^0.5*AI$29*(AI$27+273.15)/(H$32*(1-U$5))+H$33*(H$17+273.15)-AI41*H$34)/(7.9*X$18^2*H$43^0.5*AI$29/(H$32*(1-U$5))+H$33)-273.15)+AI39)/2","v":{"$error":"#DIV/0!"}},"C"]
[null,null,"Leak Elevation above Surface, h",null,null,null,null,{"$f":"IF(E43=\"\",1,E43*AB13)","v":1},"m",null,null,null,null,null,null,null,null,null,null,null,null,null,null,null,null,null,null,null,"kg/sec",1,null,null,null,"Vapor Pressure - Trial 4",{"$f":"IF($H$27=\"Liquid\",IF(Chemical=\"\",101.325*EXP(AJ$13-AJ$14/(AI42+273.15)),101.325*EXP(AI$13-AI$14/(AI42+273.15-AI$15))),0)","v":0},"kPa"]
[null,null,"Outdoor Wind Speed",null,3,"m/sec",null,{"$f":"IF(E44=\"\",3,E44)","v":3},"m/sec",null,null,"Specified Rate:",null,null,null,null,null,null,null,null,null,"Pool Temperature (equation 12-31):",null,null,null,null,null,null,"kg/min",{"$f":"1/60","v":1.6666666666666666E-2},null,null,null,"Aerosol Fraction - Trial 4",{"$f":"IF(X$14=0,0,IF(U$5<1,IF(0.043*IF(X$18<4,4,X$18)^2*H$28^0.667*AI43*H$43^0.5/(H$32*(273.15+AI42)*(1-U$5))>1,1,ROUND(0.043*IF(X$18<4,4,X$18)^2*H$28^0.667*AI43*H$43^0.5/(H$32*(273.15+AI42)*(1-U$5)),4)),0))","v":0}]
[null,null,null,null,null,null,null,null,null,null,null,"L = ",{"$f":"IF(AND($H$27=\"Liquid\",$E$5=\"Specified Rate\"),H14,0)","v":0}," kg/sec",{"$f":"\"- or -\"","v":"- or -"},{"$f":"ROUND(132*M45,2)","v":0}," lb/min",null,null,"     TP = { T' L' CS + AP ( S + UGnd TAmb - mP DHV )} / { L' CS + UGnd AP }",null,null,null,null,null,null,null,null,"kg/hr",{"$f":"1/3600","v":2.7777777777777778E-4},null,null,null,"Temperature - Trial 5",{"$f":"(MIN(H$29,(7.9*X$18^2*H$43^0.5*AI$29*(AI$27+273.15)/(H$32*(1-U$5))+H$33*(H$17+273.15)-AI44*H$34)/(7.9*X$18^2*H$43^0.5*AI$29/(H$32*(1-U$5))+H$33)-273.15)+AI42)/2","v":{"$error":"#DIV/0!"}},"C"]
[null,null,null,null,null,null,null,null,null,null,null,"1 hr Release = ",{"$f":"IF(E$19=\"\",ROUND(M45*3600,1),IF(M45*3600<H$19,ROUND(M45*3600,1),H$19))","v":0}," kg",{"$f":"\"- or -\"","v":"- or -"},{"$f":"ROUND(2.2*M46,1)","v":0}," lb",null,null,null,null,"Pool Temperature TP = ",{"$f":"ROUND(AI74,2)","v":0},{"$f":"\" C    ( \"&W46+273.15&\"  K )\"","v":" C    ( 273.15  K )"},null,null,null,null,"lb/sec",{"$f":"1/2.2046226","v":0.4535923744952991},null,null,null,"Vapor Pressure - Trial 5",{"$f":"IF($H$27=\"Liquid\",IF(Chemical=\"\",101.325*EXP(AJ$13-AJ$14/(AI45+273.15)),101.325*EXP(AI$13-AI$14/(AI45+273.15-AI$15))),0)","v":0},"kPa"]
[null,null,"Copyright © 2026",null,null,null,null,null,null,null,null,null,null,null,null,null,null,null,null,null,null,"Vapor Pressure at Pool Temp, Psat = ",{"$f":"IF(AI77=0,0,AI75)","v":0},"  kPa",null,null,null,null,"lb/min",7.5598999999999996E-3,null,null,null,"Aerosol Fraction - Trial 5",{"$f":"IF(X$14=0,0,IF(U$5<1,IF(0.043*IF(X$18<4,4,X$18)^2*H$28^0.667*AI46*H$43^0.5/(H$32*(273.15+AI45)*(1-U$5))>1,1,ROUND(0.043*IF(X$18<4,4,X$18)^2*H$28^0.667*AI46*H$43^0.5/(H$32*(273.15+AI45)*(1-U$5)),4)),0))","v":0}]
[null,null,"American Institute of Chemical Engineers",null,null,null,null,null,null,null,null,"Equipment Rupture:",null,null,null,null,null,null,null,null,null,null,{"$f":"\"Daytime with Wind Speed ( \"&E38&\" Location ) =\"","v":"Daytime with Wind Speed (  Location ) ="},{"$f":"IF(E38=\"Indoor\",0.1,H44)","v":3}," m/sec",null,null,null,"lb/hr",1.2599833333333332E-4,null,null,null,"Aerosol Temperature",{"$f":"(MIN(H$29,(7.9*X$18^2*H$43^0.5*AI$29*(AI$27+273.15)/(H$32*(1-U$5))+H$33*(H$17+273.15)-AI47*H$34)/(7.9*X$18^2*H$43^0.5*AI$29/(H$32*(1-U$5))+H$33)-273.15)+AI45)/2","v":{"$error":"#DIV/0!"}},"C"]
[null,null,null,null,null,null,null,null,null,null,null,"Total Release = ",{"$f":"IF(AND(H27=\"Liquid\",E5=\"Equipment Rupture\"),IF(E$19=\"\",ROUND(H39*H32,2),H19),0)","v":0}," kg",{"$f":"\"- or -\"","v":"- or -"},{"$f":"ROUND(2.2*M49,1)","v":0}," lb",null,null,null,null,null,null,null,null,null,null,null,"kg",1,null,null,null,"Vapor Press at Aerosol T",{"$f":"IF($H$27=\"Liquid\",IF(Chemical=\"\",101.325*EXP(AJ$13-AJ$14/(AI48+273.15)),101.325*EXP(AI$13-AI$14/(AI48+273.15-AI$15))),0)","v":0},"kPa"]
[null,null,null,null,null,null,null,null,null,null,null,"Initial Vapor = ",{"$f":"ROUND((U5+(1-U5)*U33)*M49,2)","v":0}," kg",{"$f":"\"- or -\"","v":"- or -"},{"$f":"IF(M50>0,ROUND(2.2*M50,2),0)","v":0}," lb",null,null,"Evaporation Rate (equation 12-32), mP = 0.0021 Mw2/3 u0.78 Psat / TP",null,null,null,null,null,null,null,null,"lb",0.45359240000000001,null,null,null,"Aerosol Fraction",{"$f":"IF(X$14=0,0,IF(U$5<1,IF(0.043*IF(X$18<4,4,X$18)^2*H$28^0.667*AI49*H$43^0.5/(H$32*(273.15+AI48)*(1-U$5))>1,1,ROUND(0.043*IF(X$18<4,4,X$18)^2*H$28^0.667*AI49*H$43^0.5/(H$32*(273.15+AI48)*(1-U$5)),4)),0))","v":0}]
[null,null,null,null,null,null,null,null,null,null,null,null,null,null,null,null,null,null,null,null,null,null,{"$f":"\"0.0021 ( \"&H28&\" )^2/3 ( \"&X48&\" )^0.78 ( \"&ROUND(W47,3)&\" ) / ( 273.15 + \"&W46&\" ) = \"","v":"0.0021 ( 0 )^2/3 ( 3 )^0.78 ( 0 ) / ( 273.15 + 0 ) = "},{"$f":"0.0021*H28^0.667*X48^0.78*W47/(273.15+W46)","v":0}," kg/sec m2",null,null,null,"sec",{"$f":"1/60","v":1.6666666666666666E-2},null,null,null,"Error",{"$f":"ABS(AI48-AI45)","v":{"$error":"#DIV/0!"}},"C"]
[null,null,null,null,null,null,null,null,null,null,null,null,null,null,null,null,null,null,null,null,null,null,null,null,null,null,null,null,"min",1]
[null,null,null,null,null,null,null,null,null,null,null,null,null,null,null,null,null,null,null,"Estimated Max Pool Area (equation 12-29),",null,null,null,null,"AP = L' / [ rL / ( 100 tL ) + mP / 2 ] =",null,null,null,"hr",60,null,null,null,"Pool Temperature - Trial and Error"]
[null,null,null,null,null,null,null,null,null,null,null,null,null,null,null,null,null,null,null,null,"or (Inventory - Initial Vapor) 100 / rL  for Equipment Rupture",null,null,null,null,null,null,null,"C/sec",{"$f":"60","v":60},null,null,null,"Pool Temperature - Trial 1",{"$f":"IF(AI48<AI33,AI48,AI33)","v":{"$error":"#DIV/0!"}},"C"]
[null,null,null,null,null,null,null,null,null,null,null,null,null,null,null,null,null,null,null,null,null,null,{"$f":"IF(E5=\"Equipment Rupture\",\"( \"&M49&\" - \"&M50&\" ) 100 / \"&H32&\" = \",X42&\" / [ \"&H32&\" / { 100 ( \"&X39&\" ) } + \"&ROUND(X51,6)&\" / 2 ] = \")","v":"0 / [ 0 / { 100 ( 0 ) } + 0 / 2 ] = "},{"$f":"IF(OR(H27<>\"Liquid\",AND(E5=\"Equipment Rupture\",M50>=M49),AND(E5<>\"Equipment Rupture\",X42=0)),0,IF(AND(H32>0,OR(E5=\"Equipment Rupture\",W11>0)),IF(E42=\"\",IF(E5=\"Equipment Rupture\",ROUND((M49-M50)*100/H32,2-LOG10(M49-M50)*100/H32),ROUND(X42/(H32/(100*X39)+X51/2),2-LOG10(X42/(H32/(100*X39)+X51/2)))),IF(H42>IF(E5=\"Equipment Rupture\",(M49-M50)*100/H32,X42/(H32/(100*X39)+X51/2)),IF(E5=\"Equipment Rupture\",ROUND((M49-M50)*100/H32,2-LOG10(M49-M50)*100/H32),ROUND(X42/(H32/(100*X39)+X51/2),2-LOG10(X42/(H32/(100*X39)+X51/2)))),H42)),0))","v":0}," m2",null,null,null,"C/min",1,null,null,null,"Vapor Pressure - Trial 1",{"$f":"IF($H$27=\"Liquid\",IF(Chemical=\"\",101.325*EXP(AJ$13-AJ$14/(AI54+273.15)),101.325*EXP(AI$13-AI$14/(AI54+273.15-AI$15))),0)","v":0},"kPa"]
[null,null,null,null,null,null,null,null,null,null,null,null,null,null,null,null,null,null,null,null,null,null,null,{"$f":"IF(X55=H42,\"limited to dike area\",\"\")","v":""},null,null,null,null,"C/hr",{"$f":"1/60","v":1.6666666666666666E-2},null,null,null,"Evaporation Rate - Trial 1",{"$f":"0.0021*H$28^0.667*X$48^0.78*AI55/(273.15+AI54)","v":{"$error":"#DIV/0!"}},"kg/sec m2"]
[null,null,null,null,null,null,null,null,null,null,null,null,null,null,null,null,null,null,null,"Pool Evaporation = mP AP",null,null,{"$f":"\"= ( \"&ROUND(X51,6)&\" ) ( \"&X55&\" ) =\"","v":"= ( 0 ) ( 0 ) ="},{"$f":"IF(OR(AND(E5=\"Equipment Rupture\",H27=\"Liquid\"),X55*X51<X42),ROUND(X55*X51,2),X42)","v":0}," kg/sec",null,null,null,"F/sec",{"$f":"60/1.8","v":33.333333333333336},null,null,null,"Pool Area - Trial 1",{"$f":"IF(OR(H$27<>\"Liquid\",AND(E$5=\"Equipment Rupture\",M$50>=M$49),AND(E$5<>\"Equipment Rupture\",X$42=0)),0,IF(AND(H$32>0,OR(E$5=\"Equipment Rupture\",W$11>0)),IF(E$42=\"\",IF(E$5=\"Equipment Rupture\",ROUND((M$49-M$50)*100/H$32,2-LOG10(M$49-M$50)*100/H$32),ROUND(X$42/(H$32/(100*X$39)+AI56/2),2-LOG10(X$42/(H$32/(100*X$39)+AI56/2)))),IF(H$42>IF(E$5=\"Equipment Rupture\",(M$49-M$50)*100/H$32,X$42/(H$32/(100*X$39)+AI56/2)),IF(E$5=\"Equipment Rupture\",ROUND((M$49-M$50)*100/H$32,2-LOG10(M$49-M$50)*100/H$32),ROUND(X$42/(H$32/(100*X$39)+AI56/2),2-LOG10(X$42/(H$32/(100*X$39)+AI553)))),H$42)),0))","v":0},"m2"]
[null,null,null,null,null,null,null,null,null,null,null,null,null,null,null,null,null,null,null,null,null,null,null,{"$f":"IF(X55*X51<X42,\"\",\"limited to pool fill rate\")","v":"limited to pool fill rate"},null,null,null,null,"F/min",{"$f":"1/1.8","v":0.55555555555555558},null,null,null,"Pool Temperature - Trial 2",{"$f":"IF(AI57=0,0,(MIN(H$29,((AI$54+273.15)*X$42*H$33+AI57*(AI$28+AI$30*(AI$27+273.15)-AI56*H$34))/(X$42*H$33+AI$30*AI57)-273.15))+AI54)/2","v":0},"C"]
[null,null,null,null,null,null,null,null,null,null,null,null,null,null,null,null,null,null,null,null,null,null,null,null,null,null,null,null,"F/hr",{"$f":"1/108","v":9.2592592592592587E-3},null,null,null,"Vapor Pressure - Trial 2",{"$f":"IF($H$27=\"Liquid\",IF(Chemical=\"\",101.325*EXP(AJ$13-AJ$14/(AI58+273.15)),101.325*EXP(AI$13-AI$14/(AI58+273.15-AI$15))),0)","v":0},"kPa"]
[null,null,null,null,null,null,null,null,null,null,null,null,null,null,null,null,null,null,null,null,null,null,null,null,null,null,null,null,"kcal/g mole",4.1839988820354987,null,null,null,"Evaporation Rate - Trial 2",{"$f":"0.0021*H$28^0.667*X$48^0.78*AI59/(273.15+AI58)","v":0},"kg/sec m2"]
[null,null,null,null,null,null,null,null,null,null,null,null,null,null,null,null,null,null,null,"LIQUID RELEASE - ESTIMATED AIRBORNE QUANTITY",null,null,null,null,null,null,null,null,"kJ/g mole",1,null,null,null,"Pool Area - Trial 2",{"$f":"IF(OR(H$27<>\"Liquid\",AND(E$5=\"Equipment Rupture\",M$50>=M$49),AND(E$5<>\"Equipment Rupture\",X$42=0)),0,IF(AND(H$32>0,OR(E$5=\"Equipment Rupture\",W$11>0)),IF(E$42=\"\",IF(E$5=\"Equipment Rupture\",ROUND((M$49-M$50)*100/H$32,2-LOG10(M$49-M$50)*100/H$32),ROUND(X$42/(H$32/(100*X$39)+AI60/2),2-LOG10(X$42/(H$32/(100*X$39)+AI60/2)))),IF(H$42>IF(E$5=\"Equipment Rupture\",(M$49-M$50)*100/H$32,X$42/(H$32/(100*X$39)+AI60/2)),IF(E$5=\"Equipment Rupture\",ROUND((M$49-M$50)*100/H$32,2-LOG10(M$49-M$50)*100/H$32),ROUND(X$42/(H$32/(100*X$39)+AI60/2),2-LOG10(X$42/(H$32/(100*X$39)+AI557)))),H$42)),0))","v":0},"m2"]
[null,null,null,null,null,null,null,null,null,null,null,null,null,null,null,null,null,null,null,null,null,null,null,null,null,null,null,null,"g mole/ml",1000,null,null,null,"Pool Temperature - Trial 3",{"$f":"IF(AI61=0,0,(MIN(H$29,((AI$54+273.15)*X$42*H$33+AI61*(AI$28+AI$30*(AI$27+273.15)-AI60*H$34))/(X$42*H$33+AI$30*AI61)-273.15))+AI58)/2","v":0},"C"]
[null,null,null,null,null,null,null,null,null,null,null,null,null,null,null,null,null,null,null,"Liquid Release - Airborne Quantity = L [ Fv + FD ( 1 - Fv ) ] + mP AP =",null,null,null,null,null,null,null,null,"g mole/liter",1,null,null,null,"Vapor Pressure - Trial 3",{"$f":"IF($H$27=\"Liquid\",IF(Chemical=\"\",101.325*EXP(AJ$13-AJ$14/(AI62+273.15)),101.325*EXP(AI$13-AI$14/(AI62+273.15-AI$15))),0)","v":0},"kPa"]
[null,null,null,null,null,null,null,null,null,null,null,null,null,null,null,null,null,null,null,null,null,{"$f":"W11&\" [ \"&ROUND(U5,3)&\" + \"&U33&\" ( 1 - \"&ROUND(U5,3)&\" ) ] + \"&X57&\" = \"","v":"0 [ 0 + 0 ( 1 - 0 ) ] + 0 = "},{"$f":"IF(W11>0,ROUND(W11*(U5+U33*(1-U5))+X57,3-LOG10(W11*(U5+U33*(1-U5))+X57)),0)","v":0}," kg/sec - or -",{"$f":"ROUND(132*W64,2)","v":0}," lb/min",null,null,"lb mole/cu ft",16.018460000000001,null,null,null,"Evaporation Rate - Trial 3",{"$f":"0.0021*H$28^0.667*X$48^0.78*AI63/(273.15+AI62)","v":0},"kg/sec m2"]
[null,null,null,null,null,null,null,null,null,null,null,null,null,null,null,null,null,null,null,null,null,null,null,null,null,null,null,null,"m/sec",1,null,null,null,"Pool Area - Trial 3",{"$f":"IF(OR(H$27<>\"Liquid\",AND(E$5=\"Equipment Rupture\",M$50>=M$49),AND(E$5<>\"Equipment Rupture\",X$42=0)),0,IF(AND(H$32>0,OR(E$5=\"Equipment Rupture\",W$11>0)),IF(E$42=\"\",IF(E$5=\"Equipment Rupture\",ROUND((M$49-M$50)*100/H$32,2-LOG10(M$49-M$50)*100/H$32),ROUND(X$42/(H$32/(100*X$39)+AI64/2),2-LOG10(X$42/(H$32/(100*X$39)+AI64/2)))),IF(H$42>IF(E$5=\"Equipment Rupture\",(M$49-M$50)*100/H$32,X$42/(H$32/(100*X$39)+AI64/2)),IF(E$5=\"Equipment Rupture\",ROUND((M$49-M$50)*100/H$32,2-LOG10(M$49-M$50)*100/H$32),ROUND(X$42/(H$32/(100*X$39)+AI64/2),2-LOG10(X$42/(H$32/(100*X$39)+AI561)))),H$42)),0))","v":0},"m2"]
[null,null,null,null,null,null,null,null,null,null,null,null,null,null,null,null,null,null,null,"Liquid Release - Airborne Quantity for Equipment Rupture",null,null,null,null,null,null,null,null,"ft/sec",0.30480000000000002,null,null,null,"Pool Temperature - Trial 4",{"$f":"IF(AI65=0,0,(MIN(H$29,((AI$54+273.15)*X$42*H$33+AI65*(AI$28+AI$30*(AI$27+273.15)-AI64*H$34))/(X$42*H$33+AI$30*AI65)-273.15))+AI62)/2","v":0},"C"]
[null,null,null,null,null,null,null,null,null,null,null,null,null,null,null,null,null,null,null,{"$f":"\"If Initial Vapor / Total Vapor or \"&ROUND(M50,2)&\" kg / \"&ROUND(W70,2)&\" kg < 0.01, Use Maximum Pool Evaloration Rate\"","v":"If Initial Vapor / Total Vapor or 0 kg / 0 kg < 0.01, Use Maximum Pool Evaloration Rate"},null,null,null,null,null,null,null,null,"mile/hr",0.44700000000000001,null,null,null,"Vapor Pressure - Trial 4",{"$f":"IF($H$27=\"Liquid\",IF(Chemical=\"\",101.325*EXP(AJ$13-AJ$14/(AI66+273.15)),101.325*EXP(AI$13-AI$14/(AI66+273.15-AI$15))),0)","v":0},"kPa"]
[null,null,null,null,null,null,null,null,null,null,null,null,null,null,null,null,null,null,null,null,null,"or",{"$f":"IF(OR(E5<>\"Equipment Rupture\",W70=0),0,IF(M50/W70<0.01,ROUND(X57,2),0))","v":0}," kg/sec - or -",{"$f":"ROUND(132*W68,2)","v":0}," lb/min",null,null,null,null,null,null,null,"Evaporation Rate - Trial 4",{"$f":"0.0021*H$28^0.667*X$48^0.78*AI67/(273.15+AI66)","v":0},"kg/sec m2"]
[null,null,null,null,null,null,null,null,null,null,null,null,null,null,null,null,null,null,null,null,null,null,null,null,null,null,null,null,null,null,null,null,null,"Pool Area - Trial 4",{"$f":"IF(OR(H$27<>\"Liquid\",AND(E$5=\"Equipment Rupture\",M$50>=M$49),AND(E$5<>\"Equipment Rupture\",X$42=0)),0,IF(AND(H$32>0,OR(E$5=\"Equipment Rupture\",W$11>0)),IF(E$42=\"\",IF(E$5=\"Equipment Rupture\",ROUND((M$49-M$50)*100/H$32,2-LOG10(M$49-M$50)*100/H$32),ROUND(X$42/(H$32/(100*X$39)+AI68/2),2-LOG10(X$42/(H$32/(100*X$39)+AI68/2)))),IF(H$42>IF(E$5=\"Equipment Rupture\",(M$49-M$50)*100/H$32,X$42/(H$32/(100*X$39)+AI68/2)),IF(E$5=\"Equipment Rupture\",ROUND((M$49-M$50)*100/H$32,2-LOG10(M$49-M$50)*100/H$32),ROUND(X$42/(H$32/(100*X$39)+AI68/2),2-LOG10(X$42/(H$32/(100*X$39)+AI565)))),H$42)),0))","v":0},"m2"]
[null,null,null,null,null,null,null,null,null,null,null,null,null,null,null,null,null,null,null,null,null,"  1 hour Airborne Quantity = ",{"$f":"IF(IF(E5=\"Equipment Rupture\",IF(H27=\"Liquid\",M50,M25),(W64-X57)*X39)+3600*X57<AF27,IF(E5=\"Equipment Rupture\",IF(H27=\"Liquid\",M50,M25),(W64-X57)*X39)+3600*X57,AF27)","v":0}," kg     - or -",{"$f":"ROUND(2.2*W70,1)","v":0}," lb",null,null,null,null,null,null,null,"Pool Temperature - Trial 5",{"$f":"IF(AI69=0,0,(MIN(H$29,((AI$54+273.15)*X$42*H$33+AI69*(AI$28+AI$30*(AI$27+273.15)-AI68*H$34))/(X$42*H$33+AI$30*AI69)-273.15))+AI66)/2","v":0},"C"]
[null,null,null,null,null,null,null,null,null,null,null,null,null,null,null,null,null,null,null,null,null,null,null,"based on pool evaporation for 1 hour",null,null,null,null,null,null,null,null,null,"Vapor Pressure - Trial 5",{"$f":"IF($H$27=\"Liquid\",IF(Chemical=\"\",101.325*EXP(AJ$13-AJ$14/(AI70+273.15)),101.325*EXP(AI$13-AI$14/(AI70+273.15-AI$15))),0)","v":0},"kPa"]
[null,null,null,null,null,null,null,null,null,null,null,null,null,null,null,null,null,null,null,null,null,null,null,null,null,null,null,null,null,null,null,null,null,"Evaporation Rate - Trial 5",{"$f":"0.0021*H$28^0.667*X$48^0.78*AI71/(273.15+AI70)","v":0},"kg/sec m2"]
[null,null,null,null,null,null,null,null,null,null,null,null,null,null,null,null,null,null,null,null,null,null,null,null,null,null,null,null,null,null,null,null,null,"Pool Area - Trial 5",{"$f":"IF(OR(H$27<>\"Liquid\",AND(E$5=\"Equipment Rupture\",M$50>=M$49),AND(E$5<>\"Equipment Rupture\",X$42=0)),0,IF(AND(H$32>0,OR(E$5=\"Equipment Rupture\",W$11>0)),IF(E$42=\"\",IF(E$5=\"Equipment Rupture\",ROUND((M$49-M$50)*100/H$32,2-LOG10(M$49-M$50)*100/H$32),ROUND(X$42/(H$32/(100*X$39)+AI72/2),2-LOG10(X$42/(H$32/(100*X$39)+AI72/2)))),IF(H$42>IF(E$5=\"Equipment Rupture\",(M$49-M$50)*100/H$32,X$42/(H$32/(100*X$39)+AI72/2)),IF(E$5=\"Equipment Rupture\",ROUND((M$49-M$50)*100/H$32,2-LOG10(M$49-M$50)*100/H$32),ROUND(X$42/(H$32/(100*X$39)+AI72/2),2-LOG10(X$42/(H$32/(100*X$39)+AI569)))),H$42)),0))","v":0},"m2"]
[null,null,null,null,null,null,null,null,null,null,null,null,null,null,null,null,null,null,null,null,null,null,null,null,null,null,null,null,null,null,null,null,null,"Pool Temperature",{"$f":"IF(AI73=0,0,(MIN(H$29,((AI$54+273.15)*X$42*H$33+AI73*(AI$28+AI$30*(AI$27+273.15)-AI72*H$34))/(X$42*H$33+AI$30*AI73)-273.15))+AI70)/2","v":0},"C"]
[null,null,null,null,null,null,null,null,null,null,null,null,null,null,null,null,null,null,null,null,null,null,null,null,null,null,null,null,null,null,null,null,null,"Vapor Press at Pool T",{"$f":"IF($H$27=\"Liquid\",IF(Chemical=\"\",101.325*EXP(AJ$13-AJ$14/(AI74+273.15)),101.325*EXP(AI$13-AI$14/(AI74+273.15-AI$15))),0)","v":0},"kPa"]
[null,null,null,null,null,null,null,null,null,null,null,null,null,null,null,null,null,null,null,null,null,null,null,null,null,null,null,null,null,null,null,null,null,"Evaporation Rate",{"$f":"0.0021*H$28^0.667*X$48^0.78*AI75/(273.15+AI74)","v":0},"kg/sec m2"]
[null,null,null,null,null,null,null,null,null,null,null,null,null,null,null,null,null,null,null,null,null,null,null,null,null,null,null,null,null,null,null,null,null,"Pool Area",{"$f":"IF(OR(H$27<>\"Liquid\",AND(E$5=\"Equipment Rupture\",M$50>=M$49),AND(E$5<>\"Equipment Rupture\",X$42=0)),0,IF(AND(H$32>0,OR(E$5=\"Equipment Rupture\",W$11>0)),IF(E$42=\"\",IF(E$5=\"Equipment Rupture\",ROUND((M$49-M$50)*100/H$32,2-LOG10(M$49-M$50)*100/H$32),ROUND(X$42/(H$32/(100*X$39)+AI76/2),2-LOG10(X$42/(H$32/(100*X$39)+AI76/2)))),IF(H$42>IF(E$5=\"Equipment Rupture\",(M$49-M$50)*100/H$32,X$42/(H$32/(100*X$39)+AI76/2)),IF(E$5=\"Equipment Rupture\",ROUND((M$49-M$50)*100/H$32,2-LOG10(M$49-M$50)*100/H$32),ROUND(X$42/(H$32/(100*X$39)+AI76/2),2-LOG10(X$42/(H$32/(100*X$39)+AI573)))),H$42)),0))","v":0},"m2"]
[null,null,null,null,null,null,null,null,null,null,null,null,null,null,null,null,null,null,null,null,null,null,null,null,null,null,null,null,null,null,null,null,null,"Error",{"$f":"ABS(AI74-AI70)","v":0},"C"]

{"sheet":"Vapor Dispersions","index":5,"n_rows":137,"n_cols":51,"rows_kept":137,"cut":false,"hidden":false,"merged":[[61,16,62,17],[57,16,58,17],[52,2,52,3],[42,4,42,5],[21,5,23,8],[24,5,25,5],[31,11,31,16],[35,2,36,2],[51,12,52,12],[51,13,52,13],[51,11,52,11],[40,10,40,17],[51,14,52,14],[4,4,4,5],[18,3,18,7],[5,4,5,5],[19,2,19,8],[8,0,8,9],[6,6,7,8],[2,11,2,14],[1,11,1,16],[21,11,21,16],[2,27,3,33],[0,27,1,41],[0,19,1,25],[13,30,22,33],[12,22,12,23],[20,24,20,25],[2,35,3,41],[15,22,15,23],[16,22,16,23],[22,24,22,25],[2,19,2,25],[8,11,8,17],[76,27,77,33],[13,22,13,23],[30,30,39,33],[58,27,61,33],[1,44,2,44],[16,44,16,47],[63,44,63,46],[34,44,34,47],[63,35,64,41],[45,27,46,33],[49,44,49,47],[32,35,33,41]]}
[null,null,null,null,null,null,null,null,null,null,null,null,null,null,null,null,null,null,null,"SIMPLE VAPOR DISPERSION",null,null,null,null,null,null,null,"Determination of Vapor Dispersion Correlating Parameters (equations 12-4 to 12-17)"]
[null,null,null,null,"VAPOR DISPERSION INPUT INFORMATION",null,null,null,null,null,null,"JET MIXING",null,null,null,null,null,null,null,null,null,null,null,null,null,null,null,null,null,null,null,null,null,null,null,null,null,null,null,null,null,null,null,null,"Conversion Factors"]
[null,null,null,"Required Inputs are Shaded \"Yellow\"",null,null,null,null,null,null,null,null,null,null,null,null,null,null,null,{"$f":"\"for \"&D48&\" m/sec Wind Speed, Class \"&I48&\" Atmospheric Stability, and \"&H50&\" Surface Roughness\"","v":"for 3 m/sec Wind Speed, Class D Atmospheric Stability, and Rural Surface Roughness"},null,null,null,null,null,null,null,"DENSE GAS DISPERSION (Britter-McQuaid) per Section 13-6",null,null,null,null,null,null,null,"COMBINED DENSE AND NEUTRALLY BUOYANT PLUME MODEL per Section 13-9"]
[null,"STEP 1 - Select Location, Type of Release, Concentration and Distance of Interest",null,null,null,null,null,null,null,null,null,"Vapor Density at atmospheric pressure (equation 12-21),  r0 = 0.12 P Mw / T",null,null,null,null,null,null,null,null,null,null,null,null,null,null,null,null,null,null,null,null,null,null,null,null,null,null,null,null,null,null,null,null,{"$f":"IF(F13<>\"\",VLOOKUP(F13,Conversion_Table,2,0),1)","v":1}]
[null,null,"Release Location (Assumed Outdoor if Blank)",null,null,null,null,null,null,null,null,null,null,null,{"$f":"\"   = 0.12 ( \"&101.3&\" ) ( \"&H26&\" ) / ( \"&273.15+H32&\" )  =\"","v":"   = 0.12 ( 101.3 ) ( 0 ) / ( 273.15 )  ="},{"$f":"ROUND(0.12*(101.3)*H26/(273.15+H32),3)","v":0}," kg/m3 as ideal gas",null,null,null,null,null,null,null,null,null,null,null,"Initial Vapor Density",{"$f":"IF(AND(E6<>\"Subcooled Liquid\",P11>0),ROUND(P5*P11/1000000+(1-P11/1000000)*1.18,3),IF(E6=\"Subcooled Liquid\",H36*ROUND(0.12*(101.3)*H26/(273.15+H32),3)/101.3+(1-H36/101.3)*1.18,ROUND(0.12*(101.3)*H26/(273.15+H32),3)))","v":0},"kg/m3","C at X = 0",{"$f":"IF(E6=\"Subcooled Liquid\",MIN(H36/101.3,1),IF(AND(E6=\"Vapor\",E43=\"Vertically Upward\"),AG6,1))","v":1},"volume fraction",null,"Plume Model - Dense Gas",null,null,null,null,"Combined Model",null,null,null,{"$f":"IF(F31<>\"\",VLOOKUP(F31,Conversion_Table,2,0),1)","v":1}]
[null,null,"Type of Release",null,null,null,null,null,null,null,null,"Discharge Velocity (equation 12-8 with cd=1), v0 = 1.27 Q / ( r0 d02 )",null,null,null,null,null,null,null,null,null,null,null,null,null,null,null,"Initial Buoyancy Parameter, g0 = g (r0 - ra) / ra",null,null,null,"C0 =",{"$f":"IF(AD5>0,IF(AND(E6<>\"Subcooled Liquid\",P11>0),P11/1000000,IF(E6=\"Subcooled Liquid\",MIN(H36,101.3)/101.3,1)),1)","v":1},"volume fraction",null,"Distance","Cm","ln(x)","ln(y)",null,"Distance","Cm",null,null,{"$f":"IF(F33<>\"\",VLOOKUP(F33,Conversion_Table,2,0),1)","v":1}]
[null,null,"Use Averaging Time Correction for Flammable Release",null,null,null,"Blank will not correct for flammable averaging time.",null,null,null,null,null,null,null,{"$f":"IF(E6=\"Vapor\",\"= 1.27 ( \"&H31&\" ) / [ ( \"&P5&\" )  ( \"&H40&\" )^2 ] = \",IF(E6=\"Flashing Liquid\",\"Entered Discharge Velocity times Initial Fraction Vapor = \",\"\"))","v":""},{"$f":"IF(E5<>\"Indoor\",IF(AND(H40>0,E6=\"Vapor\"),ROUND(1.27*H31/(P5*H40^2),1),IF(E6=\"Flashing Liquid\",H34,0)),0)","v":0}," m/sec",null,null,null,null,null,null,null,null,null,null,null,null,null,{"$f":"\"= 9.8 ( \"&ROUND(AD5,2)&\" - 1.18 ) / 1.18 =\"","v":"= 9.8 ( 0 - 1.18 ) / 1.18 ="},{"$f":"9.8*(AD5-1.18)/1.18","v":-9.8000000000000007},"m / sec2",null,null,null,{"$f":"AB15*AG$6","v":0.10816696914700545},{"$f":"LN(AD15)","v":0},{"$f":"LN(AK7)","v":-2.2240792350816103},{"$f":"IF(AND(AG$12=\"Yes\",AO7<AJ$14),AK$13*AO7^AM$13,NA())","v":{"$error":"#N/A"}},10,{"$f":"IF(AE$64>0,IF(AND(AG$12=\"Yes\",AO7<AJ$14),AK$13*AO7^AM$13,AE$64*(AO7-AJ$14+AJ$15)^AG$64),1)","v":1},null,null,{"$f":"IF(F36<>\"\",VLOOKUP(F36,Conversion_Table,2,0),1)","v":1}]
[null,null,null,null,null,null,null,null,null,null,null,{"$f":"IF(E6=\"Subcooled Liquid\",\"Assumed Low Velocity for Liquid Release\",\"\")","v":""},null,null,"limited to sonic velocity of ~ 108 ( T / Mw )1/2 = ",{"$f":"IF(P5>0,ROUND(108*((H32+273)/H26)^0.5,1),0)","v":0}," m/sec",null,null,null,null,null,null,null,null,null,null,null,null,null,null,"Dense Gas Volumetric Rate, q0 = ( Q / r0 at X=0 ) / C0",null,null,null,null,5.4329990884229719E-2,0,{"$f":"LN(AK8)","v":-2.9126788862039263},{"$error":"#N/A"},20,1,null,null,{"$f":"IF(F40<>\"\",VLOOKUP(F40,Conversion_Table,2,0),1)","v":1}]
["Input Units may be changed - Input Values in \"blue\" will be converted to appropriate equation units",null,null,null,null,null,null,null,null,null,null,{"$f":"IF(P7>P8,\"Unusually High Discharge Velocity.  Check inputs for release rate and discharge pipe diameter.\",\"\")","v":""},null,null,null,null,null,null,null,null,null,null,null,null,null,null,null,{"$f":"\"= ( \"&ROUND(H31,2)& \" kg/sec / \"&ROUND(P5,2)&\" kg/m^3 ) / \"&ROUND(AG6,4)&\" volume fraction = \"","v":"= ( 0 kg/sec / 0 kg/m^3 ) / 1 volume fraction = "},null,null,null,null,{"$f":"IF(P5>0,ROUND((H31/P5)/AG6,3),0)","v":0},"m3 / sec",null,null,2.1791590493601465E-2,0,-3.8262311407847776,{"$error":"#N/A"},50,1,null,null,{"$f":"IF(F42<>\"\",VLOOKUP(F42,Conversion_Table,2,0),1)","v":1}]
[null,null,null,null,"Input Value","Input Units",null,"Equation Input"," Equation Units",null,null,"Concentration at Xt (Equation 13-2), Ct = 1.18 C0 u / ( r0 f0 v0 )   at rair=1.18 Kg/m3",null,null,null,null,null,null,null,null,null,null,null,null,null,null,null,"Plume Model Correlating Parameter, f = [ g02  q0 / u5 ]1/5 =",null,null,null,null,null,null,null,null,1.090576395242452E-2,0,-4.5184638265393344,{"$error":"#N/A"},100,1,null,null,{"$f":"IF(F44<>\"\",VLOOKUP(F44,Conversion_Table,2,0),1)","v":1}]
[null,null,"Concentration of Interest",null,null,null,null,{"$f":"IF(AND(F11=\"mg/cu m\",H26=0),0,IF(F11=\"mg/cu m\",ROUND(E11*24.45/H26,2),IF(F11=\"vol %\",E11*10000,E11)))","v":0},"ppm",null,null,null,null,null,{"$f":"\"= 1.18 (1 x 10^6 ) ( \"&D48&\" ) / [ ( \"&P5&\" ) \"&IF(E6=\"Flashing Liquid\",E35,1)&\" ( \"&IF(P7<P8,P7,P8)&\" ) ]  =\"","v":"= 1.18 (1 x 10^6 ) ( 3 ) / [ ( 0 ) 1 ( 0 ) ]  ="},{"$f":"IF(H31=0,0,IF(AND(E5<>\"Indoor\",E6<>\"Subcooled Liquid\"),IF(AND(P5>0,P7>0),ROUND(1180000*D48/(P5*IF(E6=\"Flashing Liquid\",E35,1)*IF(P7<P8,P7,P8)),1),1000000),0))","v":0}," ppm",null,null,null,null,null,null,null,null,null,null,null,null,null,{"$f":"\"= [ \"&ROUND(AF7,3)&\"^2 ( \"&ROUND(AG9,2)&\" ) / \"&D48&\"^5 ]^(1/5) =\"","v":"= [ -9.8^2 ( 0 ) / 3^5 ]^(1/5) ="},{"$f":"IF(AF7>0,AF7^2*(H31/(P5*AG6))/D48^5,0)^0.2","v":0},null,null,null,null,5.4553775743707098E-3,0,-5.2111534458924869,{"$error":"#N/A"},200,1,null,"Vapor Pressure A",{"$f":"VLOOKUP(Chemical_2,Chemical_Table,COLUMN('Chemical Table'!AE1),FALSE)","v":{"$error":"#N/A"}}]
[null,null,"  Concentration of Interest for Hazard Analysis is typically 1/2 LFL, LFL, ER-2, ER-3 or LC50",null,null,null,null,null,null,null,null,null,"Alternate weather Concentration at Xt",null,null,null,null,null,null,null,"per Correlation Details with Concentration in ppmv",null,null,null,null,null,null,"Dense Gas Check, f5/6 > 0.15; ",null,null,{"$f":"IF(AF7>0,AF11^(5/6),0)","v":0},"> 0.15 -->",{"$f":"IF(AND(AF7>0,AE12>0.15),\"Yes\",\"No\")","v":"No"},null,null,null,2.1827504120124517E-3,0,-6.1271695405149504,{"$error":"#N/A"},500,1,null,"Vapor Pressure B",{"$f":"VLOOKUP(Chemical_2,Chemical_Table,COLUMN('Chemical Table'!AF1),FALSE)","v":{"$error":"#N/A"}}]
[null,null,null,"Outdoor Downwind Distance of Interest, X ",null,null,null,{"$f":"ROUND(E13*AS4,1)","v":0},"m",null,null,null,null,null,{"$f":"\"= 1.18 (1 x 10^6 ) ( \"&D49&\" ) / [ ( \"&P5&\" ) \"&IF(E6=\"Flashing Liquid\",E35,1)&\" ( \"&IF(P7<P8,P7,P8)&\" ) ]  =\"","v":"= 1.18 (1 x 10^6 ) ( 1.5 ) / [ ( 0 ) 1 ( 0 ) ]  ="},{"$f":"IF(H31=0,0,IF(AND(E5<>\"Indoor\",E6<>\"Subcooled Liquid\"),IF(AND(P5>0,P7>0),ROUND(1180000*D49/(P5*IF(E6=\"Flashing Liquid\",E35,1)*IF(P7<P8,P7,P8)),1),1000000),0))","v":0}," ppm",null,null,"Plume or Continuous:  Cm =",null,{"$f":"IF(H31>0,ROUND(AM31*1000000*H$26*D$48/H$31,-4),0)","v":0}," ( Q / Mw ) / ( u  X ^",null,{"$f":"IF(H31>0,-AO31,0)","v":0}," )",null,null,null,null,null,null,null,null,null,"Cm = ",{"$f":"IF(AG$12=\"Yes\",AF$42*EXP(INDEX(LINEST(AM7:AM12,AL7:AL12),2)),0)","v":0},"X^",{"$f":"IF(AG$12=\"Yes\",INDEX(LINEST(AM7:AM12,AL7:AL12),1)+AH$42,0)","v":0},{"$error":"#N/A"},1000,1,null,"Vapor Pressure C",{"$f":"VLOOKUP(Chemical_2,Chemical_Table,COLUMN('Chemical Table'!AG1),FALSE)","v":{"$error":"#N/A"}}]
[null,null,"  Distance of Interest is typically to the property limit, to an unrestricted work area, or to an occupied building",null,null,null,null,null,null,null,null,{"$f":"IF(E6=\"Flashing Liquid\",\"Only a Fraction of Total Vapor Present Initially at the Release Velocity\",\"\")","v":""},null,null,null,null,null,null,null,"Puff or Instantaneous:  Cm =",null,{"$f":"IF(H33>0,AM62*1000000*H$26/H$33,0)","v":0},"( Q* / Mw ) / ( X ^",null,{"$f":"IF(H$33>0,-AO62,0)","v":0}," )",null,"Cm/C0","X / ( q0 u )1/2","Distance",null,null,null,null,null,{"$f":"IF(AG$12=\"Yes\",(AK$13/AK14)^(-1/AM$13),0)","v":0},{"$f":"AB21*AG$6","v":1},"Transition Dense Gas",null,{"$error":"#N/A"},2000,1,null,"Vapor Pressure",{"$f":"IF(Chemical_2=\"\",0,ROUND(101.325*EXP(AS11-AS12/(H32+273.15-AS13)),1))","v":0},"kPa absolute"]
[null,null,null,null,"Note that Concentration of Interest is Needed for Estimation of Exposure Duration for Instantaneous Release",null,null,null,null,null,null,null,null,null,"Sonic Equiv. Discharge Diameter, d0' = d0(v0/v0')1/2= ",{"$f":"IF(P8>0,ROUND(H40*(P7/P8)^0.5,4),0)","v":0},"m",null,null,null,{"$f":"\"per Correlation Details for \"&D49&\" m/sec \"&I49&\" Stability with Concentration in ppmv\"","v":"per Correlation Details for 1.5 m/sec F Stability with Concentration in ppmv"},null,null,null,null,null,null,{"$f":"0.1*298/(273+H$32)/(0.1*298/(273+H$32)+0.9)","v":0.10816696914700545},{"$f":"IF(AG$12=\"Yes\",IF(LOG(AF$11)<-0.55,56.2,IF(LOG(AF$11)<-0.14,10^(1.88+0.24*LOG(AF$11)),10^(1.78-0.5*LOG(AF$11)))),\"\")","v":""},{"$f":"IF(AND(AG$12=\"Yes\",H$31>0),AC15*(AG$9/D$48)^0.5,1)","v":1},null,null,null,null,null,{"$f":"IF(AG$12=\"Yes\",(AE$64/AK15)^(-1/AG$64),0)","v":0},{"$f":"AK14","v":1},"Transition Neutrally Buoyant",null,{"$error":"#N/A"},5000,1,null,"Estimated Boiling Pt",{"$f":"IF(Chemical_2=\"\",\"\",ROUND(AS12/AS11+AS13-273.15,1))","v":""},"C"]
[null,null,null,null,null,null,null,null,null,null,null,"Jet Mixing Transition Distance (equation 13-3), Xt = 3.125 d0 ( v0 f0 / u ) / ( r0 / rair )1/2",null,null,null,null,null,null,null,"Plume or Continuous:  Cm =",null,{"$f":"IF(H31>0,ROUND(AU47*1000000*H$26*D$49/H$31,-4),0)","v":0}," ( Q / Mw ) / ( u  X ^",null,{"$f":"IF(H31>0,-AV47,0)","v":0}," )",null,{"$f":"0.05*298/(273+H$32)/(0.05*298/(273+H$32)+0.95)","v":5.4329990884229719E-2},{"$f":"IF(AG$12=\"Yes\",IF(LOG(AF$11)<-0.68,83.2,IF(LOG(AF$11)<-0.29,10^(2.16+0.36*LOG(AF$11)),IF(LOG(AF$11)<-0.18,114.8,10^(1.96-0.56*LOG(AF$11))))),\"\")","v":""},1,null,null,null,null,null,null,null,"Estimate of Reference Distance = ",{"$f":"$D$48*(IF(AND($H$33>0,$H$31>0),MIN($H$33/$H$31,3600),3600))","v":10800},{"$error":"#N/A"},10000,1]
[null,"STEP 2 - Enter Chemical Properties (or Select Chemical Name from Pic List)",null,null,null,null,null,null,null,null,null,null,null,null,{"$f":"\"= 3.125 ( \"&IF(P7<P8,H40,P15)&\" ) ( \"&IF(P7<P8,P7,P8)&\" ( \"&IF(E6=\"Flashing Liquid\",E35,1)&\" ) / \"&D48&\" ) ( \"&P5&\" / 1.18 )^1/2  =\"","v":"= 3.125 ( 0 ) ( 0 ( 1 ) / 3 ) ( 0 / 1.18 )^1/2  ="},{"$f":"IF(H40<>\"\",ROUND(2.877*(IF(P7<P8,H40,P15)*IF(E6=\"Flashing Liquid\",E35,1)/D48)*IF(P7<P8,P7,P8)*P5^0.5,1),0)","v":0},{"$f":"\" m  at \"&D48&\" m/sec wind\"","v":" m  at 3 m/sec wind"},null,null,"Puff or Instantaneous:  Cm =",null,{"$f":"IF(H33>0,AU76*1000000*H$26/H$33,0)","v":0},"( Q* / Mw ) / ( X ^",null,{"$f":"-AV76","v":0}," )",null,{"$f":"0.02*298/(273+H$32)/(0.02*298/(273+H$32)+0.98)","v":2.1791590493601465E-2},{"$f":"IF(AG$12=\"Yes\",IF(LOG(AF$11)<-0.69,120.2,IF(LOG(AF$11)<-0.31,10^(2.39+0.45*LOG(AF$11)),IF(LOG(AF$11)<-0.16,177.8,10^(2.16-0.54*LOG(AF$11))))),\"\")","v":""},1,null,null,null,null,null,null,null,null,null,null,null,null,null,null,"Alternate Dense Gas Plume"]
[null,null,null,null,null,null,null,null,"Cas No.",null,null,null,"Alternate weather Transition Distance",null,null,null,null,null,null,null,null,null,null,null,null,null,null,{"$f":"0.01*298/(273+H$32)/(0.01*298/(273+H$32)+0.99)","v":1.090576395242452E-2},{"$f":"IF(AG$12=\"Yes\",IF(LOG(AF$11)<-0.7,177.8,IF(LOG(AF$11)<-0.29,10^(2.59+0.49*LOG(AF$11)),IF(LOG(AF$11)<-0.2,281.8,10^(2.35-0.52*LOG(AF$11))))),\"\")","v":""},1,null,null,null,null,null,null,null,null,null,null,null,null,null,null,null,"Initial Vapor Density",{"$f":"IF(AND(E6<>\"Subcooled Liquid\",P13>0),ROUND(P5*P13/1000000+(1-P13/1000000)*1.18,3),IF(E6=\"Subcooled Liquid\",H36*ROUND(0.12*(101.3)*H26/(273.15+H32),3)/101.3+(1-H36/101.3)*1.18,ROUND(0.12*(101.3)*H26/(273.15+H32),3)))","v":0},"kg/m3","C at X = 0",{"$f":"IF(E6=\"Subcooled Liquid\",MIN(H36/101.3,1),IF(AND(E6=\"Vapor\",E43=\"Vertically Upward\"),AX19,1))","v":1},"volume fraction"]
[null,null,"Chemical Name",null,null,null,null,null,{"$f":"IF(Chemical_2=\"\",\"\",VLOOKUP(Chemical_2,Chemical_Table,COLUMN('Chemical Table'!B1),FALSE))","v":""},null,null,null,null,null,{"$f":"\"= 3.125 ( \"&IF(P7<P8,H40,P15)&\" ) ( \"&IF(P7<P8,P7,P8)&\" ( \"&IF(E6=\"Flashing Liquid\",E35,1)&\" ) / \"&D49&\" ) ( \"&P5&\" / 1.18 )^1/2  =\"","v":"= 3.125 ( 0 ) ( 0 ( 1 ) / 1.5 ) ( 0 / 1.18 )^1/2  ="},{"$f":"IF(H40<>\"\",ROUND(2.877*(IF(P7<P8,H40,P15)*IF(E6=\"Flashing Liquid\",E35,1)/D49)*IF(P7<P8,P7,P8)*P5^0.5,1),0)","v":0},{"$f":"\" m  at \"&D49&\" m/sec wind\"","v":" m  at 1.5 m/sec wind"},null,null,"Test for Plume versus Puff Model at Dispersion Conditions:  (equation 13-26)",null,null,null,null,null,null,null,{"$f":"0.005*298/(273+H$32)/(0.005*298/(273+H$32)+0.995)","v":5.4553775743707098E-3},{"$f":"IF(AG$12=\"Yes\",IF(LOG(AF$11)<-0.67,251.2,IF(LOG(AF$11)<-0.28,10^(2.8+0.59*LOG(AF$11)),IF(LOG(AF$11)<-0.15,426.6,10^(2.56-0.49*LOG(AF$11))))),\"\")","v":""},1,null,null,null,null,null,null,null,null,null,null,null,null,null,null,"Initial Buoyancy Parameter, g0 = g (r0 - ra) / ra",null,null,null,"C0 =",{"$f":"IF(AU18>0,IF(AND(E6<>\"Subcooled Liquid\",P13>0),P13/1000000,IF(E6=\"Subcooled Liquid\",MIN(H36,101.3)/101.3,1)),1)","v":1},"volume fraction"]
[null,null,null,null,null,null,null,null,null,null,null,null,null,null,null,null,null,null,null,"If  Q >  (a*/a) u Q* X^(b-b*) ---> Instantaneous Model  (from equating Puff and Plume correlation at X)",null,null,null,null,null,null,null,{"$f":"0.002*298/(273+H$32)/(0.002*298/(273+H$32)+0.998)","v":2.1827504120124517E-3},{"$f":"IF(AG$12=\"Yes\",IF(LOG(AF$11)<-0.69,398.1,IF(LOG(AF$11)<-0.25,10^(2.87+0.39*LOG(AF$11)),IF(LOG(AF$11)<-0.13,588.8,10^(2.71-0.5*LOG(AF$11))))),\"\")","v":""},1,null,null,null,null,null,null,null,null,null,null,null,null,null,null,null,null,null,{"$f":"\"= 9.8 ( \"&ROUND(AU18,2)&\" - 1.18 ) / 1.18 =\"","v":"= 9.8 ( 0 - 1.18 ) / 1.18 ="},{"$f":"9.8*(AU18-1.18)/1.18","v":-9.8000000000000007},"m / sec2"]
[null,null,null,"Data Table Value",null,null,null,null,null,null,null,null,null,null,null,null,null,null,null,null,null,null,null,{"$f":"IF(OR(H31=0,H33=0),\"\",(ROUND(H31,2)&\" kg/sec \"&IF(H31>(V14/V13)*D48*H33*AM16^(Y13-Y14),\" > \",\" < \")&\" \"&ROUND(V14/V13,5)&\" (\"&D48&\" m/sec) \"&ROUND(H33,0)&\" kg  (\"&ROUND(AM16,0)&\" m)^\"&ROUND(Y13-Y14,2))&\" or \"&ROUND((V14/V13)*D48*H33*AM16^(Y13-Y14),2)&\" kg/sec -->\")","v":""},{"$f":"IF(H33=0,\"Continuous\",IF(H31=0,\"Instantaneous\",IF(H31>(V14/V13)*D48*H33*AM16^(Y13-Y14),\"Instantaneous\",\"Continuous\")))","v":"Continuous"},null,null,{"$f":"IF(AG$12=\"Yes\",0.15^6/AF11^5,1)","v":1},"Transition",null,null,null,null,null,null,null,null,null,null,null,null,null,null,null,null,null,null,null,"Dense Gas Volumetric Rate, q0 = ( Q / r0 at X=0 ) / C0"]
[null,null,"Lower Flammable Limit, LFL ",{"$f":"IF(Chemical_2=\"\",\"\",VLOOKUP(Chemical_2,Chemical_Table,COLUMN('Chemical Table'!J1),FALSE))","v":""}," vol %","For reference in determining concentration of interest",null,null,null,null,null,"DISTANCE CORRECTION FOR INITIAL CONCENTRATION",null,null,null,null,null,null,null,null,"Alternate weather Puff versus Plume Model",null,null,null,null,null,null,null,null,null,null,null,null,null,null,null,null,null,null,null,null,null,null,null,{"$f":"\"= ( \"&ROUND(H31,2)& \" kg/sec / \"&ROUND(P5,2)&\" kg/m^3 ) / \"&ROUND(AG6,4)&\" volume fraction = \"","v":"= ( 0 kg/sec / 0 kg/m^3 ) / 1 volume fraction = "},null,null,null,null,{"$f":"IF(P5>0,ROUND((H31/P5)/AX19,3),0)","v":0},"m3 / sec"]
[null,null,"ERPG-3 Concentration ",{"$f":"IF(Chemical_2=\"\",\"\",VLOOKUP(Chemical_2,Chemical_Table,COLUMN('Chemical Table'!F1),FALSE))","v":""}," ppm",null,null,null,null,null,null,null,null,null,null,null,null,null,null,null,null,null,null,{"$f":"IF(OR(H31=0,H33=0),\"\",(ROUND(H31,2)&\" kg/sec \"&IF(H31>(V17/V16)*D49*H33*AW34^(Y16-Y17),\" > \",\" < \")&\" \"&ROUND(V17/V16,6)&\" (\"&D49&\" m/sec) \"&ROUND(H33,0)&\" kg  (\"&ROUND(AW34,0)&\" m)^\"&ROUND(Y16-Y17,2))&\" or \"&ROUND((V17/V16)*D49*H33*AW34^(Y16-Y17),2)&\" kg/sec -->\")","v":""},{"$f":"IF(H33=0,\"Continuous\",IF(H31=0,\"Instantaneous\",IF(H31>(V17/V16)*D49*H33*AW34^(Y16-Y17),\"Instantaneous\",\"Continuous\")))","v":"Continuous"},null,null,null,null,null,null,null,null,null,null,null,null,null,null,null,null,null,null,null,"Plume Model Correlating Parameter, f  =",null,null,null,{"$f":"IF(AW20>0,AW20^2*(H31/(P5*AX19))/D49^5,0)^0.2","v":0}]
[null,null,"ERPG-2 Concentration ",{"$f":"IF(Chemical_2=\"\",\"\",VLOOKUP(Chemical_2,Chemical_Table,COLUMN('Chemical Table'!E1),FALSE))","v":""}," ppm",null,null,null,null,null,null,"Vapor from Liquid Evaporation, Equipment Rupture, or Low Vapor Velocity (equation 13-25),",null,null,null,null,null,null,null,null,null,null,null,null,null,null,null,null,null,null,null,null,null,null,null,null,null,null,null,null,null,null,null,null,"Dense Gas Check, f5/6 > 0.15; ",null,null,{"$f":"IF(AF7>0,AW23^(5/6),0)","v":0},{"$f":"IF(AND(AF7>0,AV24>0.15),\"Yes\",\"No\")","v":"No"}]
[null,null,null,null,"Input Value","Leave Blank to accept Chemical Data Table Mw",null,"Equation Input",null,null,null,{"$f":"IF(Y13>0,\"Xo = \"&ROUND(V13^(1/Y13),0)&\" [ Q  / ( u Mw C at X=0 ) ]^\"&ROUND(1/Y13,2)&\" - sin(a) Xt  Continueous\",0)","v":0},null,null,null,null,null,null,null,null,null,null,null,null,null,null,null,null," Dense Gas Volume, V0 = "," ( Q* / r0 at X=0 ) / C0",null,null,null,null,null,null,null,null,null,null,null,null,null,null,"Cm/C0","X / ( Q / r0 u )1/2","Distance","Cm","ln(x)","ln(y)"]
[null,null,"Vapor Molecular Weight, Mw",{"$f":"IF(Chemical_2=\"\",\"\",VLOOKUP(Chemical_2,Chemical_Table,COLUMN('Chemical Table'!C1),FALSE))","v":""},null,null,null,{"$f":"IF(AND(D26=\"\",E26=\"\"),0,IF(E26=\"\",D26,E26))","v":0},null,null,null,{"$f":"IF(Y14>0,\"or  Xo = \"&ROUND(V14^(1/Y14),0)&\" [ Q* / ( Mw Co ) ]^\"&ROUND(1/Y14,2)&\"  Instantaneous\",0)","v":0},null,null,null,null,null,null,null,{"$f":"\"Estimated Exposure Duration - \"&Y21&\" Dispersion  (Equations 13-27, 13-29) \"","v":"Estimated Exposure Duration - Continuous Dispersion  (Equations 13-27, 13-29) "},null,null,null,null,null,null,null,{"$f":"\"= ( \"&ROUND(H33,2)& \" kg / \"&ROUND(P5,2)&\" kg/m^3 ) / \"&ROUND(AG6,4)&\" volume fraction = \"","v":"= ( 0 kg / 0 kg/m^3 ) / 1 volume fraction = "},null,null,null,null,{"$f":"ROUND((H33/P5)/AG6,1)","v":{"$error":"#DIV/0!"}},"m3",null,null,null,null,null,null,null,null,null,null,{"$f":"0.1*298/(273+H$32)/(0.1*298/(273+H$32)+0.9)","v":0.10816696914700545},{"$f":"IF(AW$24=\"Yes\",IF(LOG(AW$23)<-0.55,56.2,IF(LOG(AW$23)<-0.14,10^(1.88+0.24*LOG(AW$23)),10^(1.78-0.5*LOG(AW$23)))),\"\")","v":""},{"$f":"IF(AND(AW$24=\"Yes\",H$31>0),AT26*(AX$22/D$49)^0.5,1)","v":1},{"$f":"AS26*AX$19","v":0.10816696914700545},{"$f":"LN(AU26)","v":0},{"$f":"LN(AV26)","v":-2.2240792350816103}]
[null,null,"Normal Boiling Point, TB",{"$f":"IF(Chemical_2=\"\",\"\",IF(E27=\"F\",ROUND((1.8*AS15+32),1),AS15))","v":""},null,null,null,{"$f":"IF(AND(D27=\"\",E27=\"\"),0,IF(F27=\"F\",ROUND((IF(E27=\"\",D27,E27)-32)/1.8,1),IF(E27=\"\",D27,E27)))","v":0},"C",null,null,null,null,null,{"$f":"IF(OR(Y13>0,Y14>0),IF(Y21=\"Instantaneous\",\"= \"&ROUND(V14^(1/Y14),0)&\" [ ( \"&H33&\" / { \"&H26&\" ( \"&ROUND(1000000*AG5,0)&\" ) } ]^\"&ROUND(1/Y14,2),\"= \"&ROUND(V13^(1/Y13),0)&\" [ ( \"&H31&\" )  / { ( \"&D48&\" ) \"&H26&\" ( \"&ROUND(1000000*AG5,0)&\" ) } ]^\"&ROUND(1/Y13,2))&IF(AND(E6=\"Vapor\",E43=\"Horizontal\"),\" - (1) \"&ROUND(P17,1),\"\")&\" = \",0)","v":0},{"$f":"IF(OR(H26=0,E5=\"Indoor\"),0,IF(Y21=\"Instantaneous\",ROUND(V14^(1/Y14)*(H33/(H26*1000000*AG5))^(1/Y14),0),IF(V13^(1/Y13)*(H31/(D48*AD5*1000000*AG5))^(1/Y13)>0,ROUND(V13^(1/Y13)*(H31/(D48*H26*1000000*AG5))^(1/Y13)-IF(AND(E6=\"Vapor\",E43=\"Horizontal\"),P17,0),1),0)))","v":0}," m",null,null," t =  Q* / Q  for Continuous or 2 (0.2) [Q* Tamb / (Mw C)]0.37/ Wind Speed   for Instantaneous",null,null,null,null,null,null,null,"Puff Model Correlating Parameter, F = [ g0 (V0)1/3 / u2 ]1/2 =",null,null,null,null,null,null,null,null,null,null,null,null,null,null,null,null,{"$f":"0.05*298/(273+H$32)/(0.05*298/(273+H$32)+0.95)","v":5.4329990884229719E-2},{"$f":"IF(AW$24=\"Yes\",IF(LOG(AW$23)<-0.68,83.2,IF(LOG(AW$23)<-0.29,10^(2.16+0.36*LOG(AW$23)),IF(LOG(AW$23)<-0.18,114.8,10^(1.96-0.56*LOG(AW$23))))),\"\")","v":""},1,{"$f":"AS27*AX$19","v":5.4329990884229719E-2},{"$f":"LN(AU27)","v":0},{"$f":"LN(AV27)","v":-2.9126788862039263}]
[null,null,null,null,null,null,null,null,null,null,null,null,"Alternate weather Initial Dilution Correction",null,null,null,null,null,null,{"$f":"IF(Y21=\"Instantaneous\",\"Instanteous duration based on 2 Cloud Width at Concentration of Interest / divided by Wind Speed\",\"\")","v":""},null,null,null,null,null,null,null,null,null,null,{"$f":"\"= [ \"&ROUND(AF7,3)&\" ( \"&ROUND(AG26,2)&\" )^(1/3) / \"&D48&\"^2 ]^(1/2) =\"","v":{"$error":"#DIV/0!"}},{"$f":"IF(AF7>0,AF7*(H33/(P5*AG6))^(1/3)/D48^2,0)^0.5","v":0},null,null,null,null,null,null,null,null,null,null,null,null,{"$f":"0.02*298/(273+H$32)/(0.02*298/(273+H$32)+0.98)","v":2.1791590493601465E-2},{"$f":"IF(AW$24=\"Yes\",IF(LOG(AW$23)<-0.69,120.2,IF(LOG(AW$23)<-0.31,10^(2.39+0.45*LOG(AW$23)),IF(LOG(AW$23)<-0.16,177.8,10^(2.16-0.54*LOG(AW$23))))),\"\")","v":""},1,2.1791590493601465E-2,0,-3.8262311407847776]
[null,"STEP 3 - Enter Process Information",null,null,null,null,null,null,null,null,null,null,null,null,{"$f":"IF(OR(Y16>0,Y17>0),IF(Y23=\"Instantaneous\",\"= \"&ROUND(V17^(1/Y17),0)&\" [ ( \"&H33&\" / { \"&H26&\" ( \"&ROUND(1000000*AG5,0)&\" ) } ]^\"&ROUND(1/Y17,2),\"= \"&ROUND(V16^(1/Y16),0)&\" [ ( \"&H31&\" ) / { ( \"&D49&\" ) \"&H26&\" ( \"&ROUND(1000000*AG5,0)&\" ) } ]^\"&ROUND(1/Y16,2))&IF(AND(E6=\"Vapor\",E43=\"Horizontal\"),\" - (1) \"&ROUND(P19,1),\"\")&\" = \",0)","v":0},{"$f":"IF(OR(H26=0,E5=\"Indoor\"),0,IF(Y23=\"Instantaneous\",ROUND(V17^(1/Y17)*(H33/(H26*1000000*AG5))^(1/Y17),0),IF(V16^(1/Y16)*(H31/(D49*AD5*1000000*AG5))^(1/Y16)>0,ROUND(V16^(1/Y16)*(H31/(D49*H26*1000000*AG5))^(1/Y16)-IF(AND(E6=\"Vapor\",E43=\"Horizontal\"),P19,0),1),0)))","v":0}," m",null,null,null,null,null,null,{"$f":"IF(OR(H31=0,Y21=\"Instantaneous\"),\"t = 2 ( \"&ROUND(0.2*(H33*(298)/(H26*H11/1000000))^0.37,2)&\" m ) / \"&D48&\" m/sec = \",IF(H33=0,\"t = 3600\",\"t = \"&ROUND(H33,2)&\" Kg / \"&ROUND(H31,2)&\" Kg/sec \")&\" = \")","v":{"$error":"#DIV/0!"}},{"$f":"IF(H26=0,0,IF(H33=0,3600,MIN(3600,ROUND(IF(Y21=\"Instantaneous\",MAX(2*0.2*(H33*(298)/(H26*H11/1000000))^0.37/D48,IF(H31<>0,H33/H31,0)),H33/H31),1))))","v":0},"sec",null,"Dense Gas Check, F1/2 > 0.2; ",null,null,{"$f":"IF(AF28>0,AF28,0)","v":0},"> 0.2 -->",{"$f":"IF(AND(AF7>0,AE29>0.2),\"Yes\",\"No\")","v":"No"},null,null,null,null,null,null,null,null,null,null,null,{"$f":"0.01*298/(273+H$32)/(0.01*298/(273+H$32)+0.99)","v":1.090576395242452E-2},{"$f":"IF(AW$24=\"Yes\",IF(LOG(AW$23)<-0.7,177.8,IF(LOG(AW$23)<-0.29,10^(2.59+0.49*LOG(AW$23)),IF(LOG(AW$23)<-0.2,281.8,10^(2.35-0.52*LOG(AW$23))))),\"\")","v":""},1,1.090576395242452E-2,0,-4.5184638265393344]
[null,"Process Inputs:",null,null,"Input Value","Input Units",null,"Equation Input"," Equation Units",null,null,null,null,null,null,null,null,null,null,null,"Alternate weather Estimated Exposure Duration",null,null,null,null,null,null,null,null,null,null,null,null,null,null,null,"Combined Plume Correlation:","X = ",{"$f":"IF(AO31<>0,AW47^(-1/AO31),0)","v":0},"Cm^",{"$f":"IF(AO31<>0,1/AO31,0)","v":0},null,null,null,{"$f":"0.005*298/(273+H$32)/(0.005*298/(273+H$32)+0.995)","v":5.4553775743707098E-3},{"$f":"IF(AW$24=\"Yes\",IF(LOG(AW$23)<-0.67,251.2,IF(LOG(AW$23)<-0.28,10^(2.8+0.59*LOG(AW$23)),IF(LOG(AW$23)<-0.15,426.6,10^(2.56-0.49*LOG(AW$23))))),\"\")","v":""},1,5.4553775743707098E-3,0,-5.2111534458924869]
[null,null,"Airborne Rate, Q",null,null,null,null,{"$f":"ROUND(E31*AS5,4)","v":0},"kg/sec",null,null,null,null,null,null,null,null,null,null,null,null,null,null,{"$f":"IF(OR(H31=0,Y23=\"Instantaneous\"),\"t = 2 ( \"&ROUND(0.2*(H33*(298)/(H26*H11/1000000))^0.37,2)&\" m ) / \"&D49&\" m/sec = \",IF(H33=0,\"t = 3600\",\"t = \"&ROUND(H33,2)&\" Kg / \"&ROUND(H31,2)&\" Kg/sec \")&\" = \")","v":{"$error":"#DIV/0!"}},{"$f":"IF(H26=0,0,IF(H33=0,3600,MIN(3600,ROUND(IF(Y23=\"Instantaneous\",MAX(2*0.2*(H33*(298)/(H26*H11/1000000))^0.37/D49,IF(H31<>0,H33/H31,0)),H33/H31),1))))","v":0},"sec",null,null,null,null,null,null,null,null,null,"(Continuous)",null,"Cm =",{"$f":"AW47","v":1},"X^",{"$f":"AX47","v":0},null,null,null,{"$f":"0.002*298/(273+H$32)/(0.002*298/(273+H$32)+0.998)","v":2.1827504120124517E-3},{"$f":"IF(AW$24=\"Yes\",IF(LOG(AW$23)<-0.69,398.1,IF(LOG(AW$23)<-0.25,10^(2.87+0.39*LOG(AW$23)),IF(LOG(AW$23)<-0.13,588.8,10^(2.71-0.5*LOG(AW$23))))),\"\")","v":""},1,2.1827504120124517E-3,0,-6.1271695405149504]
[null,null,"Airborne Temperature, T",null,null,null,null,{"$f":"IF(F32=\"F\",ROUND((E32-32)/1.8,1),E32)","v":0},"C",null,null,"CORRECTION FOR RELEASE ELEVATION",null,null,null,null,null,null,null,null,null,null,null,null,null,null,null,"Cm/C0","X / ( Q / r0 )1/3","Distance",null,null,null,null,null,null,null,null,null,null,null,null,null,null,null,"Transition Dense Gas",{"$f":"IF(AW$24=\"Yes\",(AW$32/AV32)^(-1/AX$32),0)","v":0},{"$f":"IF(AW$24=\"Yes\",AX19*0.15^6/AW$23^5,1)","v":1},{"$f":"IF(AW$24=\"Yes\",AF$43*EXP(INDEX(LINEST(AX26:AX31,AW26:AW31),2)),1)","v":1},{"$f":"IF(AW$24=\"Yes\",INDEX(LINEST(AX26:AX31,AW26:AW31),1)+AH$43,1)","v":1}]
[null,null,"Total Release Quantity, Q*  (Leave Blank if Unlimited)",null,null,null,null,{"$f":"ROUND(E33*AS6,2)","v":0},"kg",null,null,null,null,null,null,null,null,null,null,"  Maximum Downwind Distance to Concentration of Interest  (per combined Dense Gas and Neuutrally Buoyant models)",null,null,null,null,null,null,null,{"$f":"0.1*298/(273+H$32)/(0.1*298/(273+H$32)+0.9)","v":0.10816696914700545},{"$f":"IF(AG$29=\"Yes\",IF(LOG(AF$28)<-0.44,5.01,IF(LOG(AF$28)<0.43,10^(0.81+0.26*LOG(AF$28)),8.51)),\"\")","v":""},{"$f":"IF(AND(H$33>0,AC33<>\"\"),AC33*(H$33/(P$5*AG$6))^(1/3),1)","v":1},null,null,null,null,null,"COMBINED DENSE AND NEUTRALLY BUOYANT PUFF MODEL",null,null,null,null,null,null,null,null,null,"Transition Neutrally Buoyant",{"$f":"IF(AW$24=\"Yes\",(AE$71/AV33)^(-1/AG$71),0)","v":0},{"$f":"AV32","v":1}]
[null,null,"  Liquid or Two-Phase Release Velocity*  (Flashing Liquid)",null,null,null,null,{"$f":"ROUND(IF(F34=\"ft/min\",E34*0.00508,E34),2)","v":0},"m/sec",null,null,"Effective Release Elevation (equation 13-18):   H = H' + 1.5 (v0/u) d0 [ sin q + 1.8 d0 ( 1- r0 / rair ) ]",null,null,null,null,null,null,null,"Continuous: X = a [ Q  / ( u  Mw Cm ) ]b - X0",null,null,null,null,null,null,null,{"$f":"0.05*298/(273+H$32)/(0.05*298/(273+H$32)+0.95)","v":5.4329990884229719E-2},{"$f":"IF(AG$29=\"Yes\",IF(LOG(AF$28)<-0.56,7.08,IF(LOG(AF$28)<0.31,10^(1+0.26*LOG(AF$28)),10^(1.12-0.12*LOG(AF$28)))),\"\")","v":""},1,null,null,null,null,null,null,null,null,null,null,null,null,null,null,null,null,null,"Alternate Estimate of Reference Distance = ",{"$f":"$D$49*(IF(AND($H$33>0,$H$31>0),MIN($H$33/$H$31,3600),3600))","v":5400},"m"]
[null,null,"  Initial Fraction Vapor*, f0 (Flashing Liquid Only)",null,null,null,null,null,"Fraction",null,null,"Sin q = ",{"$f":"IF(E43=\"Vertically Upward\",1,0)","v":0},{"$f":"\"for \"&IF(E43=\"\",\"assumed Horizontal\",E43)&\" release\"","v":"for assumed Horizontal release"},null,null,null,"rair = 1.18  Kg/m3  ",null,null,null,null,null,{"$f":"IF(Y13=0,0,\"= \"&ROUND(V13^(1/Y13),-2)&\" [ ( \"&H31&\" ) / { ( \"&D48&\" ) \"&H26&\" ( \"&ROUND(H11,2)&\" ) } ]^\"&ROUND(1/Y13,2)&\" - \"&ROUND(P27,1)&\" = \")","v":0},{"$f":"IF(OR(H11=0,H26=0,H31=0,E5=\"Indoor\",Y21=\"Instantaneous\"),0,IF(V13^(1/Y13)*(H31/(D48*H$26*H11))^(1/Y13)-P27>1,ROUND(V13^(1/Y13)*(H31/(D$48*H$26*H$11))^(1/Y13)-P$27,0),0))","v":0}," m",null,{"$f":"0.02*298/(273+H$32)/(0.02*298/(273+H$32)+0.98)","v":2.1791590493601465E-2},{"$f":"IF(AG$29=\"Yes\",IF(LOG(AF$28)<-0.66,8.91,IF(LOG(AF$28)<0.32,10^(1.19+0.36*LOG(AF$28)),10^(1.38-0.26*LOG(AF$28)))),\"\")","v":""},1,null,null,null,null,null,"Puff Model - Dense Gas",null,null,null,null,"Combined Model",null,null,null,"Combined Plume Model"]
[null,null,"Vapor Pressure at Release Temp (Subcooled Liquid Only)",{"$f":"IF(E6=\"Subcooled Liquid\",MIN(101.3,AS14),\"\")","v":""},null,null,null,{"$f":"IF(AND(E36=\"\",D36=\"\"),0,IF(E36=\"\",D36*AS7,E36*AS7))","v":0},"kPa absolute",null,null,"H' = ",{"$f":"IF(E6<>\"Vapor\",0,H42)","v":0},{"$f":"\"m   for \"&IF(E6=\"\",\"assumed Vapor\",E6)&\" release\"","v":"m   for assumed Vapor release"},null,null,null,"at ambient conditions ",null,"Instantaneous: X = a* [ (Q* / ( Mw Cm ) ]b* - X0",null,null,null,null,null,null,null,{"$f":"0.01*298/(273+H$32)/(0.01*298/(273+H$32)+0.99)","v":1.090576395242452E-2},{"$f":"IF(AG$29=\"Yes\",IF(LOG(AF$28)<-0.71,14.1,IF(LOG(AF$28)<0.37,10^(1.39+0.34*LOG(AF$28)),10^(1.66-0.38*LOG(AF$28)))),\"\")","v":""},1,null,null,null,null,null,null,"Cm","ln(x)","ln(y)",null,"Distance","Cm",null,null,null,"Cm","ln(X)","ln(Y)","ln(X)","ln(Y)"]
[null,null,null,"*Note that these inputs may not significantly change results",null,null,null,null,null,null,null,null,null,null,null,{"$f":"\"H = \"&M36&\" + 1.5 ( \"&IF(P7<P8,P7,P8)&\" / \"&D48&\" ) ( \"&H40&\" ) [ \"&M35&\" + 1.8 ( \"&H40&\" ) ( 1 - \"&P5&\" / 1.18 ) ] = \"","v":"H = 0 + 1.5 ( 0 / 3 ) ( 0 ) [ 0 + 1.8 ( 0 ) ( 1 - 0 / 1.18 ) ] = "},{"$f":"IF(AND(H42+1.5*IF(P7<P8,P7,P8)*H40*(M35+1.8*H40*(1-P5/1.18))/D48>0,E5<>\"Indoor\",E6=\"Vapor\"),ROUND(H42+1.5*IF(P7<P8,P7,P8)*H40*(M35+1.8*H40*(1-P5/1.18))/D48,1),0)","v":0}," m",null,null,null,null,null,{"$f":"IF(Y14=0,0,\"= \"&ROUND(V14^(1/Y14),-1)&\" [ \"&H33&\" / ( \"&H$26&\" ( \"&ROUND(H11,2)&\" )) ]^\"&ROUND(1/Y14,2)&\" - \"&ROUND(P27,1)&\" = \")","v":0},{"$f":"IF(OR(H11=0,H26=0,E5=\"Indoor\",Y21=\"Continuous\"),0,IF(V14^(1/Y14)*(H33/(H26*H11))^(1/Y14)-P27>1,ROUND(V14^(1/Y14)*(H33/(H26*H11))^(1/Y14)-P27,0)))","v":0}," m",null,{"$f":"0.005*298/(273+H$32)/(0.005*298/(273+H$32)+0.995)","v":5.4553775743707098E-3},{"$f":"IF(AG$29=\"Yes\",IF(LOG(AF$28)<-0.52,30.2,IF(LOG(AF$28)<0.24,10^(1.62+0.26*LOG(AF$28)),10^(1.75-0.3*LOG(AF$28)))),\"\")","v":""},1,null,null,null,null,null,null,{"$f":"AG$6*AB33","v":0.10816696914700545},{"$f":"LN(AD33)","v":0},{"$f":"LN(AK37)","v":-2.2240792350816103},{"$f":"IF(AND(AG$29=\"Yes\",AO37<AJ$45),AK$44*AO37^AM$44,NA())","v":{"$error":"#N/A"}},10,{"$f":"IF(AE$67>0,IF(AND(AG$29=\"Yes\",AO37<AJ$45),AK$44*AO37^AM$44,AE$67*(AO37-AJ$45+AJ$46)^AG$67),1)","v":1},null,null,10,{"$f":"IF(AE$71>0,IF(AND(AG$12=\"Yes\",AS37<AU$32),AW$32*AS37^AX$32,AE$71*(AS37-AU$32+AU$33)^AG$71),1)","v":1},{"$f":"LN(AS37)","v":2.3025850929940459},{"$f":"LN(AT37)","v":0},{"$f":"LN(AO7)","v":2.3025850929940459},{"$f":"LN(AP7)","v":0}]
[null,"STEP 4 - Enter Equipment and Plant Layout Information",null,null,null,null,null,null,null,null,null,null,null,null,null,{"$f":"IF(Q37=0,\"limited to 0 elevation above ground at 3 m/sec wind\",\"elevation above ground at 3 m/sec wind\")","v":"limited to 0 elevation above ground at 3 m/sec wind"},null,null,null,null,null,null,{"$f":"IF(P11<H11,\"Concentration at Jet Mixing Transition Distance less than Concentration of Interest\",\"\")","v":""},null,null,null,null,{"$f":"0.002*298/(273+H$32)/(0.002*298/(273+H$32)+0.998)","v":2.1827504120124517E-3},{"$f":"IF(AG$29=\"Yes\",IF(LOG(AF$28)<0.27,67.6,10^(1.92-0.32*LOG(AF$28))),\"\")","v":""},1,null,null,null,null,null,null,5.4329990884229719E-2,0,{"$f":"LN(AK38)","v":-2.9126788862039263},{"$error":"#N/A"},20,1,null,null,20,1,{"$f":"LN(AS38)","v":2.9957322735539909},{"$f":"LN(AT38)","v":0},2.9957322735539909,0]
[null,"Equipment and Plant Layout Inputs:",null,null,"Input Value","Input Units",null,"Equation Input"," Equation Units",null,null,null,null,null,null,null,null,null,null,"Alternate weather Maximum Downwind Distance to Concentration of Interest",null,null,null,null,null,null,null,{"$f":"0.001*298/(273+H$32)/(0.001*298/(273+H$32)+0.999)","v":1.091475139639227E-3},{"$f":"IF(AG$29=\"Yes\",IF(LOG(AF$28)<-0.1,118.9,10^(2.05-0.27*LOG(AF$28))),\"\")","v":""},1,null,null,null,null,null,null,2.1791590493601465E-2,0,-3.8262311407847776,{"$error":"#N/A"},50,1,null,null,50,1,3.912023005428146,0,3.912023005428146,0]
[null,null,"Diameter of Hole or Discharge Piping, d0",null,null,null,null,{"$f":"ROUND(E40*AS8,4)","v":0},"m",null,null,null,null,null,null,null,null,null,null,"Continuous (equation 10-xx): X = a [ Q ( F ) / ( u  Mw  Cm ) ]b - X0",null,null,null,null,null,null,null,{"$f":"IF(AND(AG$29=\"Yes\",AD5>0),0.2^3/AF28^3,1)","v":1},"Transition",null,null,null,null,null,null,null,1.090576395242452E-2,0,-4.5184638265393344,{"$error":"#N/A"},100,1,null,null,100,1,4.6051701859880918,0,4.6051701859880918,0]
[null,{"$f":"IF(I41=\"\",\" The hole size for vapor release estimate or diameter of relief system discharge piping.  If blank, no jet mixing used.\",\"\")","v":" The hole size for vapor release estimate or diameter of relief system discharge piping.  If blank, no jet mixing used."},null,null,null,null,null,null,{"$f":"IF(P7>500,\"Unusally high discharge velocity, consider increasing discharge pipe diameter   \",\"\")","v":""},null,"CONCENTRATION FOR RELEASE WITHIN ENCLOSED PROCESS AREA",null,null,null,null,null,null,null,null,null,null,null,null,{"$f":"IF(Y16=0,0,\"= \"&ROUND(V16^(1/Y16),-2)&\" [ ( \"&H31&\" ) / { ( \"&D48&\" ) \"&H26&\" ( \"&ROUND(H11,2)&\" ) } ]^\"&ROUND(1/Y16,2)&\" - \"&ROUND(P29,1)&\" = \")","v":0},{"$f":"IF(OR(H11=0,H26=0,H31=0,E5=\"Indoor\",Y23=\"Instantaneous\"),0,IF(V16^(1/Y16)*(H31/(D49*H26*H11))^(1/Y16)-P29>1,ROUND(V16^(1/Y16)*(H31/(D49*H26*H11))^(1/Y16)-P29,0),0))","v":0}," m",null,null,null,null,null,null,null,null,null,null,5.4553775743707098E-3,0,-5.2111534458924869,{"$error":"#N/A"},200,1,null,null,200,1,5.2983173665480363,0,5.2983173665480363,0]
[null,null,"Release Elevation, h  (Blank assumed at Ground)",null,null,null,null,{"$f":"ROUND(E42*AS9,0)","v":0},"m",null,null,null,null,null,null,null,null,null,null,"Instantaneous (equation 10-xx): X = a* [ (Q* / ( Mw Cm ) ]b* - X0",null,null,null,null,null,null,null,null,null,null,"Overall Roughness Correction",{"$f":"IF(H50=\"Urban\",0.38,IF(H50=\"Residential\",0.5,1))","v":1},"X^",0,null,null,2.1827504120124517E-3,0,-6.1271695405149504,{"$error":"#N/A"},500,1,null,null,500,1,6.2146080984221914,0,6.2146080984221914,0]
[null,null,"Release Direction  (Assumed Horizontal if Blank)",null,null,null,null,null,null,null,null,"Check Limit for Total Release Divided by Enclosed Volume  (equation 13-30)",null,null,null,null,null,null,null,null,null,null,null,{"$f":"IF(Y17=0,0,\"= \"&ROUND(V17^(1/Y17),-1)&\" [ \"&H33&\" / ( \"&H26&\" ( \"&ROUND(H11,2)&\" )) ]^\"&ROUND(1/Y17,2)&\" - \"&ROUND(P29,1)&\" = \")","v":0},{"$f":"IF(OR(H11=0,H26=0,E5=\"Indoor\",Y23=\"Continuous\"),0,IF(V17^(1/Y17)*(H33/(H26*H11))^(1/Y17)-P29>1,ROUND(V17^(1/Y17)*(H33/(H26*H11))^(1/Y17)-P29,0)))","v":0}," m",null,null,null,null,"Alternate Overall Roughness Correction",{"$f":"AF42","v":1},"X^",{"$f":"AH42","v":0},null,null,1.091475139639227E-3,0,{"$f":"LN(AK43)","v":-6.8202251585605245},{"$error":"#N/A"},1000,1,null,null,1000,1,6.9077552789821368,0,6.9077552789821368,0]
[null,null,"Enclosed Process Area Volume, VBldg",null,null,null,null,{"$f":"ROUND(E44*AS10,1)","v":0},"cu m",null,null,null,null,"CLimit = 2.45 x 107(Q* ) / [ Mw ( VB) ] =  ",null,{"$f":"\"2.45 x 10^7 ( \"&IF(H33=0,3600*H31,H33)&\" ) / [ \"&H26&\" ( \"&H44&\" ) ] = \"","v":"2.45 x 10^7 ( 0 ) / [ 0 ( 0 ) ] = "},{"$f":"IF(OR(E5<>\"Indoor\",H26=0,H44=0),0,IF(24500000*IF(H33=0,3600*H31,H33)/(H26*H44)>1000000,1000000,ROUND(24500000*IF(H33=0,3600*H31,H33)/(H26*H44),1)))","v":0}," ppm",null,null,null,null,null,null,null,null,null,null,null,null,"Puff and Dense Gas Roughness based on Overall Correction of 0.38 for Urban and 0.5 for Residential",null,null,null,null,"Cm = ",{"$f":"IF(AG$29=\"Yes\",AF$42*EXP(INDEX(LINEST(AM37:AM43,AL37:AL43),2)),1)","v":1},"X^",{"$f":"IF(AG$29=\"Yes\",INDEX(LINEST(AM37:AM43,AL37:AL43),1)+AH$42,1)","v":1},{"$error":"#N/A"},2000,1,null,null,2000,1,7.6009024595420822,0,7.6009024595420822,0]
[null,null,"Enclosed Process Area Ventilation Rate",null,null,"  Air Changes/Hr   (Assumed 1 if Blank)",null,null,null,null,null,null,null,null,null,null,null,null,null,"  Maximum Ground Level Concentration from Elevated Continuous Release",null,null,null,null,null,null,null,null,null,null,null,null,null,null,null,{"$f":"IF(AG$29=\"Yes\",(AK$44/AK45)^(-1/AM$44),0)","v":0},{"$f":"AG$6*AB40","v":1},"Transition Dense Gas",null,{"$error":"#N/A"},5000,1,null,null,5000,1,8.5171931914162382,0,8.5171931914162382,0]
[null,null,null,null,null,null,null,null,null,null,null,"  \"Steady State\" Concentration within Enclosed Process Area  (equation 13-31)",null,null,null,null,null,null,null,"per Neutrally Buoyant Plume Model   (equation 13-20)",null,null,null,null,null,null,null,"NEUTRALLY BUOYANT GAS DISPERSION (Pasquill-Gifford) per Section 13-8",null,null,null,null,null,null,null,{"$f":"IF(AG$29=\"Yes\",(AE$67/AK46)^(-1/AG$67),0)","v":0},{"$f":"AK45","v":1},"Transition Neutrally Buoyant",null,{"$error":"#N/A"},10000,1,null,null,10000,1,9.2103403719761836,0,9.2103403719761836,0]
[null,null,null,null,null,null,null,null,null,null,null,"CIndoor = 8.8 x 1010 ( Q / Mw ) / (VR  VB + 88020 Q / Mw ) =",null,null,null,null,null,null,null,null,null,"X at Cmax per sZ = DH / 21/2 = ",{"$f":"AE49&\" X^\"&AG49","v":"0.25 X^0.71"},null,null,null,null,null,null,null,null,null,null,null,null,null,null,null,null,null,null,null,null,null,null,null,{"$f":"EXP(INDEX(LINEST(AV37:AV46,AU37:AU46),2))","v":1},{"$f":"INDEX(LINEST(AV37:AV46,AU37:AU46),1)","v":0},{"$f":"EXP(INDEX(LINEST(AX37:AX46,AW37:AW46),2))","v":1},{"$f":"INDEX(LINEST(AX37:AX46,AW37:AW46),1)","v":0}]
[null,null,"Wind Speed ",3,"m/sec",null,null,"Atm Stability Class","D",null,null,null,null,null,null,{"$f":"\"8.8 x 10^10 ( \"&H31&\" / \"&H26&\" ) / [ \"&IF(E45=\"\",1,E45)&\" ( \"&H44&\" ) + 88020 ( \"&H31&\" ) / \"&H26&\" ] = \"","v":"8.8 x 10^10 ( 0 / 0 ) / [ 1 ( 0 ) + 88020 ( 0 ) / 0 ] = "},{"$f":"IF(AND(E5=\"Indoor\",H26>0),ROUND(88000000000*(H31/H26)/(IF(E45=\"\",1,E45)*H44+88020*H31/H26),1),0)","v":0}," ppm",null,null,null,null,{"$f":"\" X = [ \"&ROUND(Q37,1)&\" / (1.41 (\"&AE49&\")) ]^\"&ROUND(1/AG49,2)&\" = \"","v":" X = [ 0 / (1.41 (0.25)) ]^1.41 = "},{"$f":"ROUND((Q37/(1.41*AE49))^(1/AG49),1)","v":0}," m",null,null,null,null,"Plume Model sY",{"$f":"IF(H50=\"Rural\",IF(I48=\"B\",0.23,IF(I48=\"D\",0.12,0.058)),IF(H50=\"Urban\",IF(I48=\"B\",0.76,IF(I48=\"D\",0.38,0.26)),IF(I48=\"B\",0.56,IF(I48=\"D\",0.28,0.19))))","v":0.12},"X^",{"$f":"IF(H50=\"Rural\",0.93,IF(H50=\"Urban\",0.83,0.85))","v":0.93},null,null,null,null,null,null,null,null,null,null,null,null,null,"Alt Plume Dispersion",null,"Plume Dispersion"]
[null,null,"Alternate Wind Speed ",1.5,null,null,null,"Alternate Stability Class","F",null,null,null,{"$f":"IF(Q48=Q44,\"Limited to the Total Release divided by the Enclosed Volume\",\"\")","v":"Limited to the Total Release divided by the Enclosed Volume"},null,null,null,null,{"$f":"IF(AND(Q48<>Q44,E45=\"\"),\"Assuming a Ventilation Rate of 1 Air Changes per Hour\",\"\")","v":""},null,null,{"$f":"\"sigma z = \"&AE49&\" X^\"&AG49&\" = \"","v":"sigma z = 0.25 X^0.71 = "},{"$f":"AE49*X48^AG49","v":0},null,{"$f":"\"sigma y = \"&AE48&\" X^\"&AG48&\" = \"","v":"sigma y = 0.12 X^0.93 = "},{"$f":"AE48*X48^AG48","v":0},null,null,null,null,"Plume Model sZ",{"$f":"IF(H50=\"Rural\",IF(I48=\"B\",0.12,IF(I48=\"D\",0.25,0.071)),IF(H50=\"Urban\",IF(I48=\"B\",0.069,IF(I48=\"D\",0.71,0.33)),IF(I48=\"B\",0.068,IF(I48=\"D\",0.41,0.24))))","v":0.25},"X^",{"$f":"IF(H50=\"Rural\",IF(I48=\"B\",1,IF(I48=\"D\",0.71,0.72)),IF(H50=\"Urban\",IF(I48=\"B\",1.25,IF(I48=\"D\",0.65,0.71)),IF(I48=\"B\",1.22,IF(I48=\"D\",0.73,0.71))))","v":0.71}]
[null,null,null,null,null,null,"Surface Roughness","Rural",null,null,null,"Concentration within Enclosed Process Area  Time  (equation 13-32)",null,null,null,null,null,null,null,"Cmax = 5730000 ( sZ / sY ) Q / ( Mw  u DH2 )    \" ground elevation\" of 1.2 m used",null,null,null,null,null,null,null,null,null,"Puff Model sX",{"$f":"IF(I48=\"B\",0.14,IF(I48=\"D\",0.06,0.02))","v":0.06},"X^",{"$f":"IF(I48=\"B\",0.92,IF(I48=\"D\",0.92,0.89))-AH$42/3","v":0.92},null,null,null,null,null,null,null,null,null,null,null,"Alternate Dense Gas Puff"]
[null,null,null,null,null,null,null,null,null,null,null,"CIndoor = 1 X 106 [ 1 – exp-[ VR + 88200 Q / ( Mw VB ) t ] / [ Mw VB VR / ( 88200 Q ) + 1 ]:",null,null,null,null,null,null,null,null,null,null,null,{"$f":"\" = 5730000 ( \"&ROUND(V49,1)&\" / \"&ROUND(Y49,1)&\" ) \"&IF(OR(Y21=0,H31<Y21),H31,Y21)&\"  / [ ( \"&H26&\" ) \"&D48&\" ( \"&Q37&\" - 1.2 )^2  ] = \"","v":" = 5730000 ( 0 / 0 ) 0  / [ ( 0 ) 3 ( 0 - 1.2 )^2  ] = "},{"$f":"IF(OR(Y35=0,E5=\"Indoor\",Y21<>\"Continuous\"),0,IF(AND(P5>0,Q37>1.3,E6=\"Vapor\"),IF(5730000*(V49/Y49)*IF(OR(Y21=0,H31<Y21),H31,Y21)/((Q37-1.3)^2*D48*H26)<1000000,ROUND(5730000*(V49/Y49)*IF(OR(Y21=0,H31<Y21),H31,Y21)/((Q37-1.3)^2*D48*H26),1),1000000),1000000))","v":0}," ppm",null,null,null,"Puff Model sY",{"$f":"IF(I48=\"B\",0.14,IF(I48=\"D\",0.06,0.02))","v":0.06},"X^",{"$f":"IF(I48=\"B\",0.92,IF(I48=\"D\",0.92,0.89))-AH$42/3","v":0.92},null,null,null,null,null,null,null,null,null,null,null,"Puff Model Correlating Parameter, f  =",null,null,null,{"$f":"IF(AD5>0,AF7*(AG26)^(1/3)/D49^2,0)^0.5","v":0}]
[null,null,null,null,null,null,null,null,null,null,null,"Time","Concentration\nduring Release","Concentration","Average Concentration",null,null,null,null,null,null,null,null,null,null,null,null,null,null,"Puff Model sZ",{"$f":"IF(I48=\"B\",0.53,IF(I48=\"D\",0.15,0.05))/AF$42","v":0.15},"X^",{"$f":"IF(I48=\"B\",0.73,IF(I48=\"D\",0.7,0.61))-AH$42/3","v":0.7},null,null,null,null,null,null,null,null,null,null,null,"Dense Gas Check, f1/6 > 0.15; ",null,null,{"$f":"IF(AF28>0,AW51,0)","v":0},{"$f":"IF(AND(AF7>0,AV52>0.2),\"Yes\",\"No\")","v":"No"}]
[null,null,"Copyright © 2026",null,null,null,null,null,null,null,null,null,null,null,null,null,null,null,null,"  Maximum Concentration at Downwind Distance of Interest  for  X >X0",null,null,null,null,null,null,null,null,null,null,"Coefficients for Alternate of Night Weather",null,null,null,null,null,null,null,null,null,null,null,null,null,"Cm/C0","X / ( Q / r0 )1/3","Distance","Cm","ln(x)","ln(y)"]
[null,null,"American Institute of Chemical Engineers ",null,null,null,null,null,null,null,null,0,{"$f":"IF(OR($E$5<>\"Indoor\",H$26=0,H$44=0),0,IF(H31=0,Q44,1000000*(1-EXP((IF(E$45=\"\",-1,-E$45)-(88020*H$31)/(H$26*H$44))*L54))/((H$26*H$44*IF(E$45=\"\",1,E$45))/(88200*H$31)+1)))","v":0},{"$f":"IF(OR($E$5<>\"Indoor\",H$26=0,H$44=0),0,IF(AND($H$33>0,$H$31=0),$Q$44,0))","v":0},null,null,null,null,null,"Continuous (equation 13-9): Cm = a   Q / [ u Mw ( X + X0 )b ]",null,null,null,null,null,null,null,null,null,"Plume Model sY",{"$f":"IF(H50=\"Rural\",IF(I49=\"B\",0.23,IF(I49=\"D\",0.12,0.058)),IF(H50=\"Urban\",IF(I49=\"B\",0.76,IF(I49=\"D\",0.38,0.26)),IF(I49=\"B\",0.56,IF(I49=\"D\",0.28,0.19))))","v":5.8000000000000003E-2},"X^",{"$f":"IF(H50=\"Rural\",0.93,IF(H50=\"Urban\",0.83,0.85))","v":0.93},null,null,null,null,null,null,null,null,null,null,null,{"$f":"0.1*298/(273+H$32)/(0.1*298/(273+H$32)+0.9)","v":0.10816696914700545},{"$f":"IF(AW$52=\"Yes\",IF(LOG(AW$51)<-0.44,5.01,IF(LOG(AW$51)<0.43,10^(0.81+0.26*LOG(AW$51)),8.51)),\"\")","v":""},{"$f":"IF(AND(H$33>0,AT54<>\"\"),AT54*(AG$26)^(1/3),1)","v":1},{"$f":"AG$6*AS54","v":0.10816696914700545},{"$f":"LN(AU54)","v":0},{"$f":"LN(AV54)","v":-2.2240792350816103}]
[null,null,null,null,null,null,null,null,null,null,null,0.01,{"$f":"IF(OR($E$5<>\"Indoor\",H$26=0,H$44=0),0,MIN($Q$44,1000000*(1-EXP((IF(E$45=\"\",-1,-E$45)-(88020*H$31)/(H$26*H$44))*L55))/((H$26*H$44*IF(E$45=\"\",1,E$45))/(88200*H$31)+1)))","v":0},{"$f":"IF(OR($H$31=0,AND($H$33>0,$H$33/(3600*$H$31+0.000001)<L55)),IF(N54=0,$Q$44,N54)/(1+IF($E$45=0,1,$E$45)*(L55-L54)),M55)","v":0},{"$f":"(L55-L54)*(N55+N54)/2","v":0},null,"Release Duration = ",null,null,null,null,null,null,{"$f":"\" = \"&ROUND(V13,1)&\" ( \"&H31&\" ) / [ \"&D48&\" ( \"&H26&\" ) ( \"&H13&\" + \"&ROUND(P27,1)&\" )^\"&ROUND(Y13,2)&\" ] = \"","v":" = 0 ( 0 ) / [ 3 ( 0 ) ( 0 + 0 )^0 ] = "},{"$f":"IF(OR(H26=0,E5=\"Indoor\",E13=\"\",Y21=\"Instantaneous\"),0,IF(H13+P27>0,IF(V13*H31/(H26*D48*(H13+P27)^Y13)>1000000,1000000,ROUND(V13*H31/(H26*D48*(H13+P27)^Y13),1)),1000000))","v":0}," ppm",null,null,null,"Plume Model sZ",{"$f":"IF(H50=\"Rural\",IF(I49=\"B\",0.12,IF(I49=\"D\",0.25,0.071)),IF(H50=\"Urban\",IF(I49=\"B\",0.069,IF(I49=\"D\",0.71,0.33)),IF(I49=\"B\",0.068,IF(I49=\"D\",0.41,0.24))))","v":7.0999999999999994E-2},"X^",{"$f":"IF(H50=\"Rural\",IF(I49=\"B\",1,IF(I49=\"D\",0.71,0.72)),IF(H50=\"Urban\",IF(I49=\"B\",1.25,IF(I49=\"D\",0.65,0.71)),IF(I49=\"B\",1.22,IF(I49=\"D\",0.73,0.71))))","v":0.72},null,null,null,null,null,null,null,null,null,null,null,{"$f":"0.05*298/(273+H$32)/(0.05*298/(273+H$32)+0.95)","v":5.4329990884229719E-2},{"$f":"IF(AW$52=\"Yes\",IF(LOG(AW$51)<-0.56,7.08,IF(LOG(AW$51)<0.31,10^(1+0.26*LOG(AW$51)),10^(1.12-0.12*LOG(AW$51)))),\"\")","v":""},1,5.4329990884229719E-2,{"$f":"LN(AU55)","v":0},{"$f":"LN(AV55)","v":-2.9126788862039263}]
[null,null,null,null,null,null,null,null,null,null,null,0.02,{"$f":"IF(OR($E$5<>\"Indoor\",H$26=0,H$44=0),0,MIN($Q$44,1000000*(1-EXP((IF(E$45=\"\",-1,-E$45)-(88020*H$31)/(H$26*H$44))*L56))/((H$26*H$44*IF(E$45=\"\",1,E$45))/(88200*H$31)+1)))","v":0},{"$f":"IF(OR($H$31=0,AND($H$33>0,$H$33/(3600*$H$31+0.000001)<L56)),N55/(1+IF($E$45=0,1,$E$45)*(L56-L55)),M56)","v":0},{"$f":"(L56-L55)*(N56+N55)/2","v":0},null,{"$f":"IF($H$31=0,\"Instantaneous\",IF(OR($H$33=0,$H$33/(3600*$H$31)>1),1,H33/(3600*$H$31)))","v":"Instantaneous"},{"$f":"IF($H$31=0,\"\",\" hr\")","v":""},null,"Instantaneous (equation 13-13): Cm = a  ( Q* / Mw ) / ( X + X0)b ",null,null,null,null,null,null,null,null,null,"Puff Model sX",{"$f":"IF(I49=\"B\",0.14,IF(I49=\"D\",0.06,0.02))","v":0.02},"X^",{"$f":"IF(I49=\"B\",0.92,IF(I49=\"D\",0.92,0.89))-AH$43/3","v":0.89},null,null,null,null,null,null,null,null,null,null,null,{"$f":"0.02*298/(273+H$32)/(0.02*298/(273+H$32)+0.98)","v":2.1791590493601465E-2},{"$f":"IF(AW$52=\"Yes\",IF(LOG(AW$51)<-0.66,8.91,IF(LOG(AW$51)<0.32,10^(1.19+0.36*LOG(AW$51)),10^(1.38-0.26*LOG(AW$51)))),\"\")","v":""},1,2.1791590493601465E-2,0,-3.8262311407847776]
[null,null,null,null,null,null,null,null,null,null,null,0.05,0,0,0,null,null,null,null,null,null,null,null,{"$f":"\" = \"&ROUND(V14,1)&\" ( \"&H33&\" / \"&H26&\" ) / ( \"&H13&\" + \"&ROUND(P27,1)&\" )^\"&ROUND(Y14,2)&\" = \"","v":" = 0 ( 0 / 0 ) / ( 0 + 0 )^0 = "},{"$f":"IF(OR(H26=0,E5=\"Indoor\",E13=\"\",Y21=\"Continuous\"),0,IF(H13+P27>0,IF(V14*(H33/H26)/(H13+P27)^Y14>1000000,1000000,ROUND(V14*(H33/H26)/(H13+P27)^Y14,1)),1000000))","v":0}," ppm",null,null,null,"Puff Model sY",{"$f":"IF(I49=\"B\",0.14,IF(I49=\"D\",0.06,0.02))","v":0.02},"X^",{"$f":"IF(I49=\"B\",0.92,IF(I49=\"D\",0.92,0.89))-AH$43/3","v":0.89},null,null,null,null,null,null,null,null,null,null,null,{"$f":"0.01*298/(273+H$32)/(0.01*298/(273+H$32)+0.99)","v":1.090576395242452E-2},{"$f":"IF(AW$52=\"Yes\",IF(LOG(AW$51)<-0.71,14.1,IF(LOG(AW$51)<0.37,10^(1.39+0.34*LOG(AW$51)),10^(1.66-0.38*LOG(AW$51)))),\"\")","v":""},1,1.090576395242452E-2,0,-4.5184638265393344]
[null,null,null,null,null,null,null,null,null,null,null,0.1,0,0,0,null,"Average Concentration (by summation of time increments) = ",null,null,null,null,null,{"$f":"IF(H13+P27>0,\"\",\"Distance of Interest less than Initial Dilution Transition Distance - correlation does not apply\")","v":"Distance of Interest less than Initial Dilution Transition Distance - correlation does not apply"},null,null,null,null,null,null,"Puff Model sZ",{"$f":"IF(I49=\"B\",0.53,IF(I49=\"D\",0.15,0.05))/AF$43","v":0.05},"X^",{"$f":"IF(I49=\"B\",0.73,IF(I49=\"D\",0.7,0.61))-AH$43/3","v":0.61},null,null,null,null,null,null,null,null,null,null,null,{"$f":"0.005*298/(273+H$32)/(0.005*298/(273+H$32)+0.995)","v":5.4553775743707098E-3},{"$f":"IF(AW$52=\"Yes\",IF(LOG(AW$51)<-0.52,30.2,IF(LOG(AW$51)<0.24,10^(1.62+0.26*LOG(AW$51)),10^(1.75-0.3*LOG(AW$51)))),\"\")","v":""},1,5.4553775743707098E-3,0,-5.2111534458924869]
[null,null,null,null,null,null,null,null,null,null,null,0.2,0,0,0,null,null,null,null,"  Ground Level Concentration at Downwind Distance of Interest  (equation 13-19)",null,null,null,null,null,null,null,"The above neutrally buoyant dispersion coefficient correlations per: Guidelines for Chemical Process Quantitative Risk Analysis, CCPS, 2nd.  \"Residential\" Surface Roughness interpolated to correspond to z0 of 0.5 to 1 m.  Overall puff dispersion assumed to have the same response to surface roughness as plumes with correction distributed equally across sX, sY, and sZ.",null,null,null,null,null,null,null,null,null,null,null,null,null,null,null,null,{"$f":"0.002*298/(273+H$32)/(0.002*298/(273+H$32)+0.998)","v":2.1827504120124517E-3},{"$f":"IF(AW$52=\"Yes\",IF(LOG(AW$51)<0.27,67.6,10^(1.92-0.32*LOG(AW$51))),\"\")","v":""},1,2.1827504120124517E-3,0,-6.1271695405149504]
[null,null,null,null,null,null,null,null,null,null,null,0.3,0,0,0,null,{"$f":"O66","v":0}," ppm",null,"C =  Cm exp [ -0.5 ( DH / sZ } 2 ]    \"ground elevation\" of 1.2 m used",null,null,null,null,null,null,null,null,null,null,null,null,null,null,null,null,null,null,null,null,null,null,null,null,{"$f":"0.001*298/(273+H$32)/(0.001*298/(273+H$32)+0.999)","v":1.091475139639227E-3},{"$f":"IF(AW$52=\"Yes\",IF(LOG(AW$51)<-0.1,118.9,10^(2.05-0.27*LOG(AW$51))),\"\")","v":""},1,1.091475139639227E-3,{"$f":"LN(AU60)","v":0},{"$f":"LN(AV60)","v":-6.8202251585605245}]
[null,null,null,null,null,null,null,null,null,null,null,0.4,0,0,0,null,null,null,null,null,null,null,null,{"$f":"\" = ( \"&IF(Y21=\"Instantaneous\",Y57,Y55)&\" ) exp [ -0.5 { ( \"&Q37&\" - 1.2 ) / ( \"&AE49&\" ( \"&H13&\" + \"&ROUND(P27,1)&\" )^\"&AG49&\" ) }^2 ] = \"","v":" = ( 0 ) exp [ -0.5 { ( 0 - 1.2 ) / ( 0.25 ( 0 + 0 )^0.71 ) }^2 ] = "},{"$f":"IF(AND(Q37-1.2>0,E6=\"Vapor\",E42<>\"\",Y21<>\"Instantaneous\"),ROUND(Y55*EXP(-0.5*((Q37-1.2)/(AE49*(H13+IT28)^AG49))^2),1),0)","v":0}," ppm",null,null,null,null,null,null,null,null,null,null,"Combined Puff Correlation:","X = ",{"$f":"IF(AO62<>0,AW76^(-1/AO62),0)","v":0},"Cm^",{"$f":"IF(AO62<>0,1/AO62,0)","v":0},null,null,null,null,"Transition Dense Gas",{"$f":"IF(AND(AW$52=\"Yes\",AD5>0),(AW61/AV61)^(-1/AX61),0)","v":0},{"$f":"IF(AND(AW$52=\"Yes\",AD$5>0),AG$6*0.2^3/AW$51^3,1)","v":1},{"$f":"IF(AW$52=\"Yes\",AF$43*EXP(INDEX(LINEST(AX54:AX60,AW54:AW60),2)),1)","v":1},{"$f":"IF(AW$52=\"Yes\",INDEX(LINEST(AX54:AX60,AW54:AW60),1)+AH$43,1)","v":1}]
[null,null,null,null,null,null,null,null,null,null,null,0.5,0,0,0,null,"Estimated Average Concentration using Equation 13-32 at t = Release Duration / 2",null,null,null,null,null,null,null,null,null,null,null,null,null,null,null,null,null,null,"(Instantaneous)",null,"Cm =",{"$f":"AW76","v":1},"X^",{"$f":"AX76","v":0},null,null,null,null,"Transition Neutrally Buoyant",{"$f":"IF(AW$52=\"Yes\",(AE$74/AV62)^(-1/AG$74),0)","v":0},{"$f":"AV61","v":1}]
[null,null,null,null,null,null,null,null,null,null,null,0.6,0,0,0]
[null,null,null,null,null,null,null,null,null,null,null,0.8,0,0,0,null,{"$f":"IF(OR($E$5<>\"Indoor\",H$26=0,H$44=0),0,IF(H31=0,Q44/(1+0.5*IF(E$45=\"\",1,E$45)),MIN($Q$44,1000000*(1-EXP((IF(E$45=\"\",-1,-E$45)-(88020*H$31)/(H$26*H$44))*Q56/2))/((H$26*H$44*IF(E$45=\"\",1,E$45))/(88200*H$31)+1))))","v":0}," ppm",null,null,null,null,null,null,null,null,null,null,"Plume Correlation:","Cm = ",{"$f":"IF(H$26>0,(24.45*H$31/(H$26*D$48))*IF(F7=\"Yes\",2,1)/(3.142*AE48*AE49),0)","v":0}," X^",{"$f":"-(AG48+AG49)","v":-1.6400000000000001},null,null,"COMBINED MODEL PUFF ISOPLETH at GROUND ELEVATION\nbased on Neutrally Buoyant Dispersion Coefficients",null,null,null,null,null,null,null,null,"Combined Puff Model"]
[null,null,null,null,null,null,null,null,null,null,null,1,0,0,0,null,null,null,null,null,null,null,null,null,null,null,null,null,null,"X =",{"$f":"IF(AE64>0,AE64^(-1/AG64),0)","v":0},"Cm ^",{"$f":"1/AG64","v":-0.6097560975609756},null,null,null,null,null,null,null,null,null,null,null,"Distance","Cm","ln(X)","ln(Y)","ln(X)","ln(Y)"]
[null,null,null,null,null,null,null,null,null,null,null,null,null,"Average = ",{"$f":"SUM(O55:O65)","v":0},null,null,null,null,null,null,null,null,null,null,null,null,null,null,null,null,null,null,null,null,null,null,null,null,"Based on Distance to Concentration of Interest",{"$f":"Y$37","v":0},"m",null,null,10,{"$f":"IF(AE$74>0,IF(AND(AW$52=\"Yes\",AS66<AU$61),AW$61*AS66^AX$61,AE$74*(AS66-AU$61+AU$62)^AG$74),1)","v":1},{"$f":"LN(AS66)","v":2.3025850929940459},{"$f":"LN(AT66)","v":0},{"$f":"LN(AO37)","v":2.3025850929940459},{"$f":"LN(AP37)","v":0}]
[null,null,null,null,null,null,null,null,null,null,null,null,null,null,null,null,null,null,null,null,null,null,null,null,null,null,null,null,"Puff Correlation:","Cm = ",{"$f":"IF(H$26>0,2*H$33*(24.45/H$26)*IF(F7=\"Yes\",2,1)/((2*3.142)^1.5*AE50*AE51*AE52),0)","v":0},"X^",{"$f":"-(AG50+AG51+AG52)","v":-2.54},null,null,null,null,null,null,"Concentration of Interest",{"$f":"H$11","v":0},"ppmv",null,null,20,1,{"$f":"LN(AS67)","v":2.9957322735539909},{"$f":"LN(AT67)","v":0},{"$f":"LN(AO38)","v":2.9957322735539909},{"$f":"LN(AP38)","v":0}]
[null,null,null,null,null,null,null,null,null,null,null,null,null,null,null,null,null,null,null,null,null,null,null,null,null,null,null,null,null,"X =",{"$f":"IF(AE67>0,AE67^(-1/AG67),0)","v":0},"Cm^",{"$f":"1/AG67","v":-0.39370078740157477},null,null,null,null,null,null,"and Time to Distance to Concentration of Interest",{"$f":"AO66/D48","v":0},"sec",null,null,50,1,3.912023005428146,0,{"$f":"LN(AO39)","v":3.912023005428146},0]
[null,null,null,null,null,null,null,null,null,null,null,null,null,null,null,null,null,null,null,null,null,null,null,null,null,null,null,null,null,null,null,null,null,null,null,null,"Time (sec)","Distance, X","sY, sX","Cm","Distance, Y","X-ut",null,null,100,1,4.6051701859880918,0,{"$f":"LN(AO40)","v":4.6051701859880918},0]
[null,null,null,null,null,null,null,null,null,null,null,null,null,null,null,null,null,null,null,null,null,null,null,null,null,null,null,null,null,null,"Coefficients for Alternate of Night Weather",null,null,null,null,null,{"$f":"0.1*AO$68","v":0},{"$f":"AK70*D$48","v":0},{"$f":"IF(AL70>0,AE$51*AL70^AG$51,1)","v":1},{"$f":"IF(AL70>0,IF(V$14*(H$33/H$26)/(AL70+P$27)^Y$14>1000000,1000000,V$14*(H$33/H$26)/(AL70+P$27)^Y$14),0)","v":0},{"$f":"IF(AL70>0,AM70*(-2*LN(AO$67/AN70))^0.5,0)","v":0},{"$f":"AO70","v":0},null,null,200,1,5.2983173665480363,0,{"$f":"LN(AO41)","v":5.2983173665480363},0]
[null,null,null,null,null,null,null,null,null,null,null,null,null,null,null,null,null,null,null,null,null,null,null,null,null,null,null,null,"Plume Correlation:","Cm = ",{"$f":"IF(H$26>0,(24.45*H$31/(H$26*D$49))*IF(F7=\"Yes\",2,1)/(3.142*AE54*AE55),0)","v":0}," X^",{"$f":"-(AG54+AG55)","v":-1.65},null,null,null,null,{"$f":"AL70-AO70","v":0},null,{"$f":"AN70*EXP(-0.5*(AO70/AM70)^2)","v":0},0,{"$f":"AO71","v":0},null,null,500,1,6.2146080984221914,0,{"$f":"LN(AO42)","v":6.2146080984221914},0]
[null,null,null,null,null,null,null,null,null,null,null,null,null,null,null,null,null,null,null,null,null,null,null,null,null,null,null,null,null,"X =",{"$f":"IF(AE71>0,AE71^(-1/AG71),0)","v":0},"Cm ^",{"$f":"1/AG71","v":-0.60606060606060608},null,null,null,null,{"$f":"AL70-0.67*AO70","v":0},null,{"$f":"AN70*EXP(-0.5*(0.67*AO70/AM70)^2)","v":0},{"$f":"IF(AN72>0,AM70*(-2*LN(AO$67/AN72))^0.5,0)","v":0},{"$f":"AO72","v":0},null,null,1000,1,6.9077552789821368,0,{"$f":"LN(AO43)","v":6.9077552789821368},0]
[null,null,null,null,null,null,null,null,null,null,null,null,null,null,null,null,null,null,null,null,null,null,null,null,null,null,null,null,null,null,null,null,null,null,null,null,null,{"$f":"AL70","v":0},null,{"$f":"AN70","v":0},{"$f":"AO70","v":0},0,null,null,2000,1,7.6009024595420822,0,{"$f":"LN(AO44)","v":7.6009024595420822},0]
[null,null,null,null,null,null,null,null,null,null,null,null,null,null,null,null,null,null,null,null,null,null,null,null,null,null,null,null,"Puff Correlation:","Cm = ",{"$f":"IF(H$26>0,2*H$33*(24.45/H$26)*IF(F7=\"Yes\",2,1)/((2*3.142)^1.5*AE56*AE57*AE58),0)","v":0},"X^",{"$f":"-(AG56+AG57+AG58)","v":-2.39},null,null,null,null,{"$f":"AL70+0.67*AO70","v":0},null,{"$f":"AN70*EXP(-0.5*(0.67*AO70/AM70)^2)","v":0},{"$f":"IF(AN74>0,AM70*(-2*LN(AO$67/AN74))^0.5,0)","v":0},0,null,null,5000,1,8.5171931914162382,0,{"$f":"LN(AO45)","v":8.5171931914162382},0]
[null,null,null,null,null,null,null,null,null,null,null,null,null,null,null,null,null,null,null,null,null,null,null,null,null,null,null,null,null,"X =",{"$f":"IF(AE74>0,AE74^(-1/AG74),0)","v":0},"Cm^",{"$f":"1/AG74","v":-0.41841004184100417},null,null,null,null,{"$f":"AL70+AO70","v":0},null,{"$f":"AN70*EXP(-0.5*(AO70/AM70)^2)","v":0},0,0,null,null,10000,1,9.2103403719761836,0,{"$f":"LN(AO46)","v":9.2103403719761836},0]
[null,null,null,null,null,null,null,null,null,null,null,null,null,null,null,null,null,null,null,null,null,null,null,null,null,null,null,null,null,null,null,null,null,null,null,null,null,{"$f":"AL74","v":0},null,null,{"$f":"-AO74","v":0},{"$f":"AO76","v":0},null,null,null,null,{"$f":"EXP(INDEX(LINEST(AV66:AV75,AU66:AU75),2))","v":1},{"$f":"INDEX(LINEST(AV66:AV75,AU66:AU75),1)","v":0},{"$f":"EXP(INDEX(LINEST(AX66:AX75,AW66:AW75),2))","v":1},{"$f":"INDEX(LINEST(AX66:AX75,AW66:AW75),1)","v":0}]
[null,null,null,null,null,null,null,null,null,null,null,null,null,null,null,null,null,null,null,null,null,null,null,null,null,null,null,"COMBINED MODEL PLUME ISOPLETH\nbased on Neutrally Buoyant Dispersion Coefficients",null,null,null,null,null,null,null,null,null,{"$f":"AL73","v":0},null,null,{"$f":"-AO73","v":0},{"$f":"AO77","v":0},null,null,null,null,"Alt Puff Dispersion",null,"Puff Dispersion"]
[null,null,null,null,null,null,null,null,null,null,null,null,null,null,null,null,null,null,null,null,null,null,null,null,null,null,null,null,null,null,null,null,null,null,null,null,null,{"$f":"AL72","v":0},null,null,{"$f":"-AO72","v":0},0]
[null,null,null,null,null,null,null,null,null,null,null,null,null,null,null,null,null,null,null,null,null,null,null,null,null,null,null,null,null,null,null,"Based on Distance to Concentration of Interest",{"$f":"Y$35","v":0},"m",null,null,null,{"$f":"AL71","v":0},null,null,{"$f":"-AO71","v":0},0,null,null,"Alternate Puff Cloud Width at 1/2 Distance to Concentration of Interest"]
[null,null,null,null,null,null,null,null,null,null,null,null,null,null,null,null,null,null,null,null,null,null,null,null,null,null,null,null,null,null,null,"Concentration of Interest",{"$f":"H$11","v":0},"ppmv",null,null,{"$f":"0.25*AO$68","v":0},{"$f":"AK80*D$48","v":0},{"$f":"IF(AL80>0,AE$51*AL80^AG$51,1)","v":1},{"$f":"IF(AL80>0,IF(V$14*(H$33/H$26)/(AL80+P$27)^Y$14>1000000,1000000,V$14*(H$33/H$26)/(AL80+P$27)^Y$14),0)","v":0},{"$f":"IF(AL80>0,AM80*(-2*LN(AO$67/AN80))^0.5,0)","v":0},{"$f":"AO80","v":0},null,null,null,"Distance, X","sY, sX","Cm","Distance, Y"]
[null,null,null,null,null,null,null,null,null,null,null,null,null,null,null,null,null,null,null,null,null,null,null,null,null,null,null,null,null,null,null,"Equivalent Release Elevation (vapor release only)",{"$f":"Q$37","v":0},"m",null,null,null,{"$f":"AL80-AO80","v":0},null,{"$f":"AN80*EXP(-0.5*(AO80/AM80)^2)","v":0},0,{"$f":"AO81","v":0},null,null,null,{"$f":"Y43*0.5","v":0},{"$f":"AE57*AT81^AG57","v":0},{"$f":"IF(AT81>0,IF(V$17*(H$33/H$26)/(AT81+P$27)^Y$17>1000000,1000000,V$17*(H$33/H$26)/(AT81+P$27)^Y$17),0)","v":0},{"$f":"IF(AT81>0,AU81*(-2*LN(AO$67/AV81))^0.5,0)","v":0}]
[null,null,null,null,null,null,null,null,null,null,null,null,null,null,null,null,null,null,null,null,null,null,null,null,null,null,null,null,"Distance, X","sY","Cm","Distance, Y","Area",null,null,null,null,{"$f":"AL80-0.67*AO80","v":0},null,{"$f":"AN80*EXP(-0.5*(0.67*AO80/AM80)^2)","v":0},{"$f":"IF(AN82>0,AM80*(-2*LN(AO$67/AN82))^0.5,0)","v":0},{"$f":"AO82","v":0}]
[null,null,null,null,null,null,null,null,null,null,null,null,null,null,null,null,null,null,null,null,null,null,null,null,null,null,null,null,0,0,{"$f":"AG6*1000000","v":1000000},0,0,null,null,null,null,{"$f":"AL80","v":0},null,{"$f":"AN80","v":0},{"$f":"AO80","v":0},0]
[null,null,null,null,null,null,null,null,null,null,null,null,null,null,null,null,null,null,null,null,null,null,null,null,null,null,null,null,{"$f":"0.05*AG$79","v":0},{"$f":"AE$48*AC84^AG$48","v":0},{"$f":"IF(AG$79=0,0,IF(V$13*IF(F$7=\"Yes\",2,1)*H$31/(H$26*D$48*(AC84+P$27)^Y$13)>1000000,1000000,V$13*IF(F$7=\"Yes\",2,1)*H$31/(H$26*D$48*(AC84+P$27)^Y$13))*EXP(-0.5*((Q$37-1.2)/(AE$49*(AC84+P$27)^AG$49))^2))","v":0},{"$f":"IF(AND(Y$21=\"Continuous\",AG$79>0,AE84>AG$80),(-2*LN(AE$94/AE84)*AD84^2)^0.5,0)","v":0},{"$f":"(AC84-AC83)*(AF84+AF83)/2","v":0},null,null,null,null,{"$f":"AL80+0.67*AO80","v":0},null,{"$f":"AN80*EXP(-0.5*(0.67*AO80/AM80)^2)","v":0},{"$f":"IF(AN84>0,AM80*(-2*LN(AO$67/AN84))^0.5,0)","v":0},0]
[null,null,null,null,null,null,null,null,null,null,null,null,null,null,null,null,null,null,null,null,null,null,null,null,null,null,null,null,{"$f":"0.1*AG$79","v":0},0,0,0,{"$f":"(AC85-AC84)*(AF85+AF84)/2","v":0},null,null,null,null,{"$f":"AL80+AO80","v":0},null,{"$f":"AN80*EXP(-0.5*(AO80/AM80)^2)","v":0},0,0]
[null,null,null,null,null,null,null,null,null,null,null,null,null,null,null,null,null,null,null,null,null,null,null,null,null,null,null,null,{"$f":"0.2*AG$79","v":0},0,0,0,0,null,null,null,null,{"$f":"AL84","v":0},null,null,{"$f":"-AO84","v":0},{"$f":"AO86","v":0}]
[null,null,null,null,null,null,null,null,null,null,null,null,null,null,null,null,null,null,null,null,null,null,null,null,null,null,null,null,{"$f":"0.4*AG$79","v":0},0,0,0,0,null,null,null,null,{"$f":"AL83","v":0},null,null,{"$f":"-AO83","v":0},{"$f":"AO87","v":0}]
[null,null,null,null,null,null,null,null,null,null,null,null,null,null,null,null,null,null,null,null,null,null,null,null,null,null,null,null,{"$f":"0.6*AG$79","v":0},0,0,0,0,null,null,null,null,{"$f":"AL82","v":0},null,null,{"$f":"-AO82","v":0},0]
[null,null,null,null,null,null,null,null,null,null,null,null,null,null,null,null,null,null,null,null,null,null,null,null,null,null,null,null,{"$f":"0.8*AG$79","v":0},0,0,0,0,null,null,null,null,{"$f":"AL81","v":0},null,null,{"$f":"-AO81","v":0},0]
[null,null,null,null,null,null,null,null,null,null,null,null,null,null,null,null,null,null,null,null,null,null,null,null,null,null,null,null,{"$f":"0.9*AG$79","v":0},0,0,0,0,null,null,null,{"$f":"0.5*AO$68","v":0},{"$f":"AK90*D$48","v":0},{"$f":"IF(AL90>0,AE$51*AL90^AG$51,1)","v":1},{"$f":"IF(AL90>0,IF(V$14*(H$33/H$26)/(AL90+P$27)^Y$14>1000000,1000000,V$14*(H$33/H$26)/(AL90+P$27)^Y$14),0)","v":0},{"$f":"IF(AL90>0,AM90*(-2*LN(AO$67/AN90))^0.5,0)","v":0},{"$f":"AO90","v":0}]
[null,null,null,null,null,null,null,null,null,null,null,null,null,null,null,null,null,null,null,null,null,null,null,null,null,null,null,null,{"$f":"0.95*AG$79","v":0},0,0,0,0,null,null,null,null,{"$f":"AL90-AO90","v":0},null,{"$f":"AN90*EXP(-0.5*(AO90/AM90)^2)","v":0},0,{"$f":"AO91","v":0}]
[null,null,null,null,null,null,null,null,null,null,null,null,null,null,null,null,null,null,null,null,null,null,null,null,null,null,null,null,{"$f":"0.98*AG$79","v":0},0,0,0,0,null,null,null,null,{"$f":"AL90-0.67*AO90","v":0},null,{"$f":"AN90*EXP(-0.5*(0.67*AO90/AM90)^2)","v":0},{"$f":"IF(AN92>0,AM90*(-2*LN(AO$67/AN92))^0.5,0)","v":0},{"$f":"AO92","v":0}]
[null,null,null,null,null,null,null,null,null,null,null,null,null,null,null,null,null,null,null,null,null,null,null,null,null,null,null,null,{"$f":"0.99*AG$79","v":0},0,0,0,0,null,null,null,null,{"$f":"AL90","v":0},null,{"$f":"AN90","v":0},{"$f":"AO90","v":0},0]
[null,null,null,null,null,null,null,null,null,null,null,null,null,null,null,null,null,null,null,null,null,null,null,null,null,null,null,null,{"$f":"AG$79","v":0},0,0,0,0,null,null,null,null,{"$f":"AL90+0.67*AO90","v":0},null,{"$f":"AN90*EXP(-0.5*(0.67*AO90/AM90)^2)","v":0},{"$f":"IF(AN94>0,AM90*(-2*LN(AO$67/AN94))^0.5,0)","v":0},0]
[null,null,null,null,null,null,null,null,null,null,null,null,null,null,null,null,null,null,null,null,null,null,null,null,null,null,null,null,0,null,null,0,null,null,null,null,null,{"$f":"AL90+AO90","v":0},null,{"$f":"AN90*EXP(-0.5*(AO90/AM90)^2)","v":0},0,0]
[null,null,null,null,null,null,null,null,null,null,null,null,null,null,null,null,null,null,null,null,null,null,null,null,null,null,null,null,{"$f":"AC84","v":0},null,null,{"$f":"-AF84","v":0},null,null,null,null,null,{"$f":"AL94","v":0},null,null,{"$f":"-AO94","v":0},{"$f":"AO96","v":0}]
[null,null,null,null,null,null,null,null,null,null,null,null,null,null,null,null,null,null,null,null,null,null,null,null,null,null,null,null,{"$f":"AC85","v":0},null,null,{"$f":"-AF85","v":0},null,null,null,null,null,{"$f":"AL93","v":0},null,null,{"$f":"-AO93","v":0},{"$f":"AO97","v":0}]
[null,null,null,null,null,null,null,null,null,null,null,null,null,null,null,null,null,null,null,null,null,null,null,null,null,null,null,null,0,null,null,0,null,null,null,null,null,{"$f":"AL92","v":0},null,null,{"$f":"-AO92","v":0},0]
[null,null,null,null,null,null,null,null,null,null,null,null,null,null,null,null,null,null,null,null,null,null,null,null,null,null,null,null,0,null,null,0,null,null,null,null,null,{"$f":"AL91","v":0},null,null,{"$f":"-AO91","v":0},0]
[null,null,null,null,null,null,null,null,null,null,null,null,null,null,null,null,null,null,null,null,null,null,null,null,null,null,null,null,0,null,null,0,null,null,null,null,{"$f":"0.75*AO$68","v":0},{"$f":"AK100*D$48","v":0},{"$f":"IF(AL100>0,AE$51*AL100^AG$51,1)","v":1},{"$f":"IF(AL100>0,IF(V$14*(H$33/H$26)/(AL100+P$27)^Y$14>1000000,1000000,V$14*(H$33/H$26)/(AL100+P$27)^Y$14),0)","v":0},{"$f":"IF(AL100>0,AM100*(-2*LN(AO$67/AN100))^0.5,0)","v":0},{"$f":"AO100","v":0}]
[null,null,null,null,null,null,null,null,null,null,null,null,null,null,null,null,null,null,null,null,null,null,null,null,null,null,null,null,0,null,null,0,null,null,null,null,null,{"$f":"AL100-AO100","v":0},null,{"$f":"AN100*EXP(-0.5*(AO100/AM100)^2)","v":0},0,{"$f":"AO101","v":0}]
[null,null,null,null,null,null,null,null,null,null,null,null,null,null,null,null,null,null,null,null,null,null,null,null,null,null,null,null,0,null,null,0,null,null,null,null,null,{"$f":"AL100-0.67*AO100","v":0},null,{"$f":"AN100*EXP(-0.5*(0.67*AO100/AM100)^2)","v":0},{"$f":"IF(AN102>0,AM100*(-2*LN(AO$67/AN102))^0.5,0)","v":0},{"$f":"AO102","v":0}]
[null,null,null,null,null,null,null,null,null,null,null,null,null,null,null,null,null,null,null,null,null,null,null,null,null,null,null,null,0,null,null,0,null,null,null,null,null,{"$f":"AL100","v":0},null,{"$f":"AN100","v":0},{"$f":"AO100","v":0},0]
[null,null,null,null,null,null,null,null,null,null,null,null,null,null,null,null,null,null,null,null,null,null,null,null,null,null,null,null,0,null,null,0,null,null,null,null,null,{"$f":"AL100+0.67*AO100","v":0},null,{"$f":"AN100*EXP(-0.5*(0.67*AO100/AM100)^2)","v":0},{"$f":"IF(AN104>0,AM100*(-2*LN(AO$67/AN104))^0.5,0)","v":0},0]
[null,null,null,null,null,null,null,null,null,null,null,null,null,null,null,null,null,null,null,null,null,null,null,null,null,null,null,null,0,null,null,0,null,null,null,null,null,{"$f":"AL100+AO100","v":0},null,{"$f":"AN100*EXP(-0.5*(AO100/AM100)^2)","v":0},0,0]
[null,null,null,null,null,null,null,null,null,null,null,null,null,null,null,null,null,null,null,null,null,null,null,null,null,null,null,null,0,null,null,0,null,null,null,null,null,{"$f":"AL104","v":0},null,null,{"$f":"-AO104","v":0},{"$f":"AO106","v":0}]
[null,null,null,null,null,null,null,null,null,null,null,null,null,null,null,null,null,null,null,null,null,null,null,null,null,null,null,null,null,null,null,null,null,null,null,null,null,{"$f":"AL103","v":0},null,null,{"$f":"-AO103","v":0},{"$f":"AO107","v":0}]
[null,null,null,null,null,null,null,null,null,null,null,null,null,null,null,null,null,null,null,null,null,null,null,null,null,null,null,null,null,null,null,null,null,null,null,null,null,{"$f":"AL102","v":0},null,null,{"$f":"-AO102","v":0},0]
[null,null,null,null,null,null,null,null,null,null,null,null,null,null,null,null,null,null,null,null,null,null,null,null,null,null,null,null,null,null,null,null,null,null,null,null,null,{"$f":"AL101","v":0},null,null,{"$f":"-AO101","v":0},0]
[null,null,null,null,null,null,null,null,null,null,null,null,null,null,null,null,null,null,null,null,null,null,null,null,null,null,null,null,null,null,null,null,null,null,null,null,{"$f":"0.95*AO$68","v":0},{"$f":"AK110*D$48","v":0},{"$f":"IF(AL110>0,AE$51*AL110^AG$51,1)","v":1},{"$f":"IF(AL110>0,IF(V$14*(H$33/H$26)/(AL110+P$27)^Y$14>1000000,1000000,V$14*(H$33/H$26)/(AL110+P$27)^Y$14),0)","v":0},{"$f":"IF(AL110>0,AM110*(-2*LN(AO$67/AN110))^0.5,0)","v":0},{"$f":"AO110","v":0}]
[null,null,null,null,null,null,null,null,null,null,null,null,null,null,null,null,null,null,null,null,null,null,null,null,null,null,null,null,null,null,null,null,null,null,null,null,null,{"$f":"AL110-AO110","v":0},null,{"$f":"AN110*EXP(-0.5*(AO110/AM110)^2)","v":0},0,{"$f":"AO111","v":0}]
[null,null,null,null,null,null,null,null,null,null,null,null,null,null,null,null,null,null,null,null,null,null,null,null,null,null,null,null,null,null,null,null,null,null,null,null,null,{"$f":"AL110-0.67*AO110","v":0},null,{"$f":"AN110*EXP(-0.5*(0.67*AO110/AM110)^2)","v":0},{"$f":"IF(AN112>0,AM110*(-2*LN(AO$67/AN112))^0.5,0)","v":0},{"$f":"AO112","v":0}]
[null,null,null,null,null,null,null,null,null,null,null,null,null,null,null,null,null,null,null,null,null,null,null,null,null,null,null,null,null,null,null,null,null,null,null,null,null,{"$f":"AL110","v":0},null,{"$f":"AN110","v":0},{"$f":"AO110","v":0},0]
[null,null,null,null,null,null,null,null,null,null,null,null,null,null,null,null,null,null,null,null,null,null,null,null,null,null,null,null,null,null,null,null,null,null,null,null,null,{"$f":"AL110+0.67*AO110","v":0},null,{"$f":"AN110*EXP(-0.5*(0.67*AO110/AM110)^2)","v":0},{"$f":"IF(AN114>0,AM110*(-2*LN(AO$67/AN114))^0.5,0)","v":0},0]
[null,null,null,null,null,null,null,null,null,null,null,null,null,null,null,null,null,null,null,null,null,null,null,null,null,null,null,null,null,null,null,null,null,null,null,null,null,{"$f":"AL110+AO110","v":0},null,{"$f":"AN110*EXP(-0.5*(AO110/AM110)^2)","v":0},0,0]
[null,null,null,null,null,null,null,null,null,null,null,null,null,null,null,null,null,null,null,null,null,null,null,null,null,null,null,null,null,null,null,null,null,null,null,null,null,{"$f":"AL114","v":0},null,null,{"$f":"-AO114","v":0},{"$f":"AO116","v":0}]
[null,null,null,null,null,null,null,null,null,null,null,null,null,null,null,null,null,null,null,null,null,null,null,null,null,null,null,null,null,null,null,null,null,null,null,null,null,{"$f":"AL113","v":0},null,null,{"$f":"-AO113","v":0},{"$f":"AO117","v":0}]
[null,null,null,null,null,null,null,null,null,null,null,null,null,null,null,null,null,null,null,null,null,null,null,null,null,null,null,null,null,null,null,null,null,null,null,null,null,{"$f":"AL112","v":0},null,null,{"$f":"-AO112","v":0},0]
[null,null,null,null,null,null,null,null,null,null,null,null,null,null,null,null,null,null,null,null,null,null,null,null,null,null,null,null,null,null,null,null,null,null,null,null,null,{"$f":"AL111","v":0},null,null,{"$f":"-AO111","v":0},0]
[]
[]
[null,null,null,null,null,null,null,null,null,null,null,null,null,null,null,null,null,null,null,null,null,null,null,null,null,null,null,null,null,null,null,"Based on Concentration of Interest",{"$f":"H$11","v":0},"ppmv",null,null,{"$f":"\"Time = \"&ROUND(AK70,1)&\" sec\"","v":"Time = 0 sec"},{"$f":"\"Time = \"&ROUND(AK80,1)&\" sec\"","v":"Time = 0 sec"},{"$f":"\"Time = \"&ROUND(AK90,1)&\" sec\"","v":"Time = 0 sec"},{"$f":"\"Time = \"&ROUND(AK100,1)&\" sec\"","v":"Time = 0 sec"},{"$f":"\"Time = \"&ROUND(AK110,1)&\" sec\"","v":"Time = 0 sec"}]
[null,null,null,null,null,null,null,null,null,null,null,null,null,null,null,null,null,null,null,null,null,null,null,null,null,null,null,null,null,null,null,"Equivalent Release Elevation",{"$f":"AG81","v":0},"m"]
[null,null,null,null,null,null,null,null,null,null,null,null,null,null,null,null,null,null,null,null,null,null,null,null,null,null,null,null,null,null,"Cloud Footprint Area =",{"$f":"2*SUM(AG84:AG94)","v":0},"m2"]
[null,null,null,null,null,null,null,null,null,null,null,null,null,null,null,null,null,null,null,null,null,null,null,null,null,null,null,null,null,null,"Note that footprint area will be greater for dense gas release"]
[]
[]
[]
[]
[]
[]
[]
[]
[]
[]
[]
[null,null,null,null,null,null,null,null,null,null,null,null,null,null,null,null,null,null,null,null,null,null,null,null,null,null,null,null,null,null,null,null,null,null,null,null,null,null,null,null,"Based on Concentration of Interest",{"$f":"H$11","v":0},"ppmv"]

{"sheet":"Explosions","index":6,"n_rows":51,"n_cols":32,"rows_kept":51,"cut":false,"hidden":false,"merged":[[49,2,49,3],[41,4,41,5],[20,29,20,30],[28,21,29,21],[28,22,28,24],[4,4,4,7],[24,3,24,7],[5,0,5,9],[29,25,32,26],[1,30,2,30],[4,22,4,24],[4,21,5,21],[13,29,13,30],[5,25,8,26],[0,11,1,17],[19,11,20,17],[36,11,37,17],[0,20,1,26],[24,20,25,26]]}
[null,null,null,null,null,null,null,null,null,null,null,"SIMPLE TNT MODEL per Section 14.4",null,null,null,null,null,null,null,null,"BAKER-STREHLOW-TANG MODEL per Section 14.6"]
[null,null,null,null,"EXPLOSION INPUT INFORMATION",null,null,null,null,null,null,null,null,null,null,null,null,null,null,null,null,null,null,null,null,null,null,null,null,null,"Conversion Factors"]
[null,null,null,"Required Inputs are Shaded \"Yellow\"",null,null,null,null,null,null,null,null,null,null,"Physical Explosion",null,null,null,null,null,null,null,null,"Building or Head Space Explosion"]
[null,"STEP 1 - Select Type of Explosion and Distance of Interest",null,null,null,null,null,null,null,null,null,null,null,null,null,null,null,"Note: PA = 101.3 kPa",null,null,null,null,null,null,null,null,null,null,null,null,{"$f":"IF(F8<>\"\",VLOOKUP(F8,Conversion_Table,2,0),1)","v":1}]
[null,null,"Type of Explosion:",null,null,null,null,null,null,null,null,"Equivalent Vapor Volume, V* = VV + VL FV (rL/rV)  (equation 14-2)",null,null,null,null,null,null,null,null,null,"Fuel Reactivity","Obstacle Density or Congestion",null,null,null,null,null,null,null,{"$f":"IF(F12<>\"\",VLOOKUP(F12,Conversion_Table,2,0),1)","v":1}]
["Input Units may be changed - Input Values in \"blue\" will be converted to appropriate equation units",null,null,null,null,null,null,null,null,null,null,null,null,null,null,{"$f":"\" = ( \"&H13&\" ) [ (  \"&E15&\" ) ( \"&E16&\" ) ( \"&H28&\" / ( \"&H32&\" ) + ( 1 - \"&E15&\" ) ] =\"","v":" = ( 0 ) [ (   ) (  ) (  / (  ) + ( 1 -  ) ] ="},{"$f":"IF(AND(E5=\"Physical Explosion (Equipment Rupture)\",H32<>\"\"),ROUND(H13*(E15*E16*H28/H32+(1-E15)),2),H13)","v":0}," m3",null,null,null,null,"Low","Medium","High",{"$f":"IF(E38=\"Yes\",\"Use Mach > 1 for 1 D Confinement\",\"Use Mach \"&AE15&\" for \"&IF(H30=\"Class 1 Dust\",V9,IF(H30<>\"High\",V8,V7))&\"Fuel Reactivity and \"&IF(E37=\"Low\",W6,IF(E37=\"High\",Y6,X6))&\" Confinement\")","v":"Use Mach 0.5 for Low-Medium Fuel Reactivity and Medium Confinement"},null,null,null,null,{"$f":"IF(F13<>\"\",VLOOKUP(F13,Conversion_Table,2,0),1)","v":1}]
[null,null,null,null,"Input Value","Input Units",null,"Equation Input"," Equation Units",null,null,"Physical Explosion Energy (equation 14-1), QPV = V* PB [ ln ( PB / PA ) + ( PA / PB ) - 1 ]",null,null,null,null,null,null,null,null,null,"High ",0.5,">1",">1",null,null,null,null,null,{"$f":"IF(F20<>\"\",VLOOKUP(F20,Conversion_Table,2,0),1)","v":1}]
[null,null,"Distance of Interest, X",null,null,null,null,{"$f":"ROUND(E8*AE4,1)","v":0},"m",null,null,null,null,null,null,{"$f":"\" = ( \"&Q6&\" ) ( \"&H12+101.3&\" ) [ LN (\"&H12+101.3&\" / 101.3 ) + ( 101.3 / \"&H12+101.3&\" ) - 1 ] = \"","v":" = ( 0 ) ( 101.3 ) [ LN (101.3 / 101.3 ) + ( 101.3 / 101.3 ) - 1 ] = "},{"$f":"IF($E$5=\"Physical Explosion (Equipment Rupture)\",ROUND(Q6*(101.3+H12)*(LN((101.3+H12)/101.3)+101.3/(101.3+H12)-1),1),0)","v":0}," kJ",null,null,null,"Low-Medium ",0.35,0.5,1,null,null,null,null,null,{"$f":"IF(F21<>\"\",VLOOKUP(F21,Conversion_Table,2,0),1)","v":1}]
[null,null,null,null,null,null,null,null,null,null,null,null,"kgTNTeq = QPV / 4690 =",{"$f":"ROUND(Q8/4690,2)","v":0}," kg",null,null,null,null,null,null,"Class I Dust ",null,0.35,0.5,null,null,null,null,null,{"$f":"IF(F36<>\"\",VLOOKUP(F36,Conversion_Table,2,0),1)","v":1}]
[null,"STEP 2 - Enter Equipment Burst Pressure and Volume for Physical Explosion",null,null,null,null,null,null,{"$f":"IF(E5<>\"Physical Explosion (Equipment Rupture)\",\"Skip Step\",\"\")","v":"Skip Step"},null,null,null,null,null,null,null,null,null,null,null,null,null,null,null,null,null,null,null,null,null,{"$f":"IF(F43<>\"\",VLOOKUP(F43,Conversion_Table,2,0),1)","v":1}]
[null,"Physical Explosion (Rupture) Inputs:",null,null,"Input Value","Input Units",null,"Equation Input",null,null,null,"  Scaled Overpressure at 1 psi = 0.068",null,null,null,null,null,null,null,null,null,null,null,null,"Potential Explosion Site (PES) Volume, VPES = VB = ",{"$f":"IF($E$5=\"Building or Head Space Explosion\",H36,0)","v":0}," m3",null,null,null,{"$f":"IF(F44<>\"\",VLOOKUP(F44,Conversion_Table,2,0),1)","v":1}]
[null,null,"Burst Pressure (gauge), PB - P0",null,null,null,null,{"$f":"ROUND(E12*AE5,1)","v":0}," kPa gauge",null,null,"  Scaled Distance = 18 = X / kgTNTeq1/3",null,null,null,null,null,null,null,null,null,null,null,null,null,null,null,null,null,null,{"$f":"IF(F45<>\"\",VLOOKUP(F45,Conversion_Table,2,0),1)","v":1}]
[null,null,"Equipment Volume, VEquip",null,null,null,null,{"$f":"ROUND(E13*AE6,4)","v":0}," cu m",null,null,null,null,{"$f":"\"Distance to 1 psi = 18 ( \"&N9&\" )^1/3 = \"","v":"Distance to 1 psi = 18 ( 0 )^1/3 = "},{"$f":"IF(AND(N9>0,$E$5=\"Physical Explosion (Equipment Rupture)\"),ROUND(18*(N9)^0.333,1)&\"  m\",0)","v":0},null,null,null,null,null,null,null,null,"Explosion Energy (equation 14-6), QE = 3500 VPES = ",null,null,"Note: PA = 101.3 kPa",null,null,null,{"$f":"IF(F46<>\"\",VLOOKUP(F46,Conversion_Table,2,0),1)","v":1}]
[null,null,"Burst Temperature, TBurst",null,null,null,null,{"$f":"IF(F14=\"F\",ROUND((E14-32)/1.8,1),E14)","v":0}," C",null,null,null,null,null,null,null,null,null,null,null,null,{"$f":"\" 3500 kJ/m^3 ( \"&H36&\" m^3 ) = \"","v":" 3500 kJ/m^3 ( 0 m^3 ) = "},{"$f":"ROUND(3500*Z11,-1)","v":0}," kJ",null,null,null,null,null,"Building Explosion"]
[null,null,"Fraction Liquid Level (if Superheated), FF",null,null,null,null,null,null,null,null,"From Graph, Scaled Distance, R = X / kgTNTeq1/3 =",null,null,null,null,null,null,null,null,"  Scaled Overpressure at 1 psi = 0.068",null,null,null,null,null,null,null,null,"Mach No.",{"$f":"IF(E38=\"Yes\",\">1\",IF(H30=\"Class 1 Dust\",IF(E37=\"Low\",0,IF(E37=\"High\",0.5,0.35)),IF(H30=\"High\",IF(E37=\"Low\",0.5,\">1\"),IF(E37=\"Low\",0.35,IF(E37=\"High\",1,0.5)))))","v":0.5}]
[null,null,"Flash Fract during Depressurization, FV",null,null,null,null,null,null,null,null,null,{"$f":"H8&\" / ( \"&N9&\" )^1/3 = \"","v":"0 / ( 0 )^1/3 = "},{"$f":"IF(N9>0,ROUND(H8/(N9)^0.333,2),0)","v":0},null,null,null,null,null,null,null,null,"  Scaled Distance, R = X / (2 QE / P0 )1/3 = ",{"$f":"IF(OR(AND(H30=\"Class 1 Dust\",E37=\"Low\"),E5<>\"Building or Head Space Explosion\"),0,IF(AE15=1,4.1,IF(AE15=0.5,2.5,IF(AE15=0.35,1.5,5))))","v":0},null,null,null,null,null,"Mach >1",{"$f":"IF(X21>0,IF(0.45/X21^1.17<20,0.45/X21^1.17,20),0)","v":0}]
[null,null,null,null,null,null,null,null,null,null,null,"Scaled Overpressure  =",null,{"$f":"IF(N16<=0,0,IF(EXP(160/(8.3+LN(N16))-17)>MIN(0.7,H12/101.3),\"> \"&MIN(0.7,ROUND(H12/101.3,3)),MIN(ROUND(H12/101.3,3),ROUND(EXP(160/(8.3+LN(N16))-17),3))))","v":0},null,null,null,null,null,null,"Distance to 1 psi = R (2 QE / P0 )1/3 =",null,null,null,null,null,null,null,null,"Mach 1",{"$f":"IF(X21>0,IF(0.33/X21^1.12<1.2,0.33/X21^1.12,1.2),0)","v":0}]
[null,"STEP 3 - Enter Quantity and Heat of Reaction for Condensed Phase Explosion",null,null,null,null,null,null,{"$f":"IF(E5<>\"Condensed Phase Explosive\",\"Skip Step\",\"\")","v":"Skip Step"},null,null,null,{"$f":"\"Overpressure at \"&H8&\" m  = \"","v":"Overpressure at 0 m  = "},{"$f":"IF(N17=0,0,IF(N17=\"> \"&MIN(0.7,ROUND(H12/101.3,3)),\"> \"&MIN(10,ROUND(14.7*H12/101.3,2)),ROUND(N17*14.7,1)))& \" psi   or\"","v":"0 psi   or"},{"$f":"IF(N17=0,0,IF(N17=\"> \"&MIN(0.7,ROUND(H12/101.3,3)),\"> \"&MIN(69,ROUND(101.3*H12/101.3,2)),ROUND(N17*101.3,1)))& \" kPa\"","v":"0 kPa"},null,null,null,null,null,null,null,{"$f":"X16&\" [ 2 ( \"&W14&\" ) / 101.3 ]^1/3 = \"","v":"0 [ 2 ( 0 ) / 101.3 ]^1/3 = "},{"$f":"IF(OR(AND(H30=\"Class 1 Dust\",E37=\"Low\"),E5<>\"Building or Head Space Explosion\"),0,ROUND(X16*(2*W14/101.3)^0.333,1)&\"  m\")","v":0},null,null,null,null,null,"Mach 0.5",{"$f":"IF(X21>0,IF(0.18/X21^1.06<0.45,0.18/X21^1.06,0.45),0)","v":0}]
[null,"Condensed Phase Explosive Inputs:",null,null,"Input Value","Input Units",null,"Equation Input",null,null,null,null,null,null,null,null,null,null,null,null,null,null,null,null,null,null,null,null,null," Mach 0.35",{"$f":"IF(X21>0,IF(0.1/X21<0.22,0.1/X21,0.22),0)","v":0}]
[null,null,"Mass of Material, M",null,null,null,null,{"$f":"IF(E20=\"\",0,ROUND(E20*AE7,2))","v":0}," kg",null,null,"SIMPLE TNT MODEL",null,null,null,null,null,null,null,null,"From Graph, Scaled Distance, R = X / (2 QE / P0 )1/3 = ",null,null,null,null,null,null,null,null,"Scaled Overpressure",{"$f":"IF(AND(H30=\"Class 1 Dust\",E37=\"Low\"),0,IF(AE15=1,AE17,IF(AE15=0.5,AE18,IF(AE15=0.35,AE19,AE16))))","v":0}]
[null,null,"Heat of Reaction per Mass, DHR",null,null,null,null,{"$f":"IF(E21=\"\",0,ROUND(E21*AE8,1))","v":0}," kJ/kg",null,null,null,null,null,null,null,null,null,null,null,null,null,{"$f":"H8&\" / [ 2 ( \"&W14&\" ) / 101.3 ]^1/3 = \"","v":"0 / [ 2 ( 0 ) / 101.3 ]^1/3 = "},{"$f":"IF(W14>0,ROUND(H8/(2*W14/101.3)^0.333,3),0)","v":0},null,null,null,null,null,"Vapor Cloud Explosion"]
[null,null,null,null,null,null,null,null,null,null,null,null,null,null,"Condensed Phase Explosive",null,null,null,null,null,"Scaled Overpressure  =",null,{"$f":"IF(AE20>0.7,\"> 0.7\",ROUND(AE20,3))","v":0},null,null,null,null,null,null,"Mach No.",{"$f":"IF(H30=\"High\",IF(E47=\"Low\",0.5,\">1\"),IF(E47=\"Low\",0.35,IF(E47=\"High\",1,0.5)))","v":0.5}]
[null,"STEP 4 - Enter Chemical Properties (or Select Chemical Name from Pic List)",null,null,null,null,null,null,{"$f":"IF(AND($E$5<>\"Building or Head Space Explosion\",$E$5<>\"Vapor Cloud Explosion\",$E$5<>\"Physical Explosion (Equipment Rupture)\"),\"Skip Step\",\"\")","v":"Skip Step"},null,null,null,null,null,null,null,null,null,null,null,null,{"$f":"\"Overpressure at \"&H8&\" m  = \"","v":"Overpressure at 0 m  = "},{"$f":"IF(W22=0,0,IF(W22<0.7,ROUND(W22*14.7,1)& \" psi   or\",\"> 10 psi   or\"))","v":0},{"$f":"IF(W22=0,0,IF(W22<0.7,ROUND(W22*101.3,1)& \" kPa\",\"> 69 kPa\"))","v":0},null,null,null,null,null,"Mach >1",{"$f":"IF(X46>0,IF(0.45/X46^1.17<20,0.45/X46^1.17,20),0)","v":0}]
[null,null,null,null,null,null,null,null,"Cas No.",null,null,"Chemical Explosion Energy (equation 14-4),  QChem = h M ( DHR )",null,null,null,null,null,null,null,null,null,null,null,null,null,null,null,null,null,"Mach 1",{"$f":"IF(X46>0,IF(0.33/X46^1.12<1.2,0.33/X46^1.12,1.2),0)","v":0}]
[null,null,"Chemical Name",null,null,null,null,null,{"$f":"IF(Chemical_3=\"\",\"\",VLOOKUP(Chemical_3,Chemical_Table,COLUMN('Chemical Table'!B1),FALSE))","v":""},null,null,"   assuming reaction efficiency, h = 0.5",null,null,null,{"$f":"\" = 0.5 ( \"&H20&\" ) ( \"&H21&\" ) = \"","v":" = 0.5 ( 0 ) ( 0 ) = "},{"$f":"0.5*H20*H21","v":0}," KJ",null,null,"BAKER-STREHLOW-TANG MODEL",null,null,null,null,null,null,null,null,"Mach 0.5",{"$f":"IF(X46>0,IF(0.18/X46^1.06<0.45,0.18/X46^1.06,0.45),0)","v":0}]
[null,null,null,null,"Data Table Value","User Value",null,"Equation Input",null,null,null,null,"kgTNTeq = QChem/ 4690 =",{"$f":"IF(E5=\"Condensed Phase Explosive\",ROUND(Q25/4690,2),0)","v":0}," kg",null,null,null,null,null,null,null,null,null,null,null,null,null,null," Mach 0.35",{"$f":"IF(X46>0,IF(0.1/X46<0.22,0.1/X46,0.22),0)","v":0}]
[null,null,null,"Vapor Molecular Weight, Mw ",{"$f":"IF(Chemical_3=\"\",\"\",VLOOKUP(Chemical_3,Chemical_Table,COLUMN('Chemical Table'!C1),FALSE))","v":""},null,null,{"$f":"IF(AND(D27=\"\",E27=\"\"),0,IF(F27=\"\",E27,F27))","v":""},null,null,null,null,null,null,null,null,null,null,null,null,null,null,null,"Vapor Cloud Explosion (based on 3 m/sec wind speed)",null,null,null,null,null,"Scaled Overpressure",{"$f":"IF(AE22=1,AE24,IF(AE22=0.5,AE25,IF(AE22=0.35,AE26,AE23)))","v":0}]
[null,null,null,"Liquid Density, rL (at Burst Temperature)",{"$f":"IF(Chemical_3=\"\",\"\",AE32)","v":""},null,null,{"$f":"IF(AND(D28=\"\",E28=\"\"),0,IF(F28=\"\",E28,F28))","v":""}," kg/m3",null,null,"  Scaled Overpressure at 1 psi = 0.068"]
[null,null,null,"Lower Flammable Limit, LFL ",{"$f":"IF(Chemical_3=\"\",\"\",VLOOKUP(Chemical_3,Chemical_Table,COLUMN('Chemical Table'!J1),FALSE))","v":""},null,null,{"$f":"IF(AND(D29=\"\",E29=\"\"),0,IF(F29=\"\",E29,F29))","v":""}," vol %",null,null,"  Scaled Distance = 18 = X / kgTNTeq1/3",null,null,null,null,null,null,null,null,null,"Fuel Reactivity","Obstacle Density or Congestion",null,null,null,null,null,null,"Liquid Density A",{"$f":"VLOOKUP(Chemical_3,Chemical_Table,COLUMN('Chemical Table'!X1),FALSE)","v":{"$error":"#N/A"}}]
[null,"Fuel Reactivity based on Fundamental Burning Velocity",null,null,{"$f":"IF(Chemical_3=\"\",\"\",VLOOKUP(Chemical_3,Chemical_Table,COLUMN('Chemical Table'!S1),FALSE))","v":""},null,null,{"$f":"IF(AND(E30=\"\",F30=\"\"),\"Medium\",IF(F30=\"\",E30,F30))","v":"Medium"},null,null,null,null,null,{"$f":"\"Distance to 1 psi = 18 ( \"&N26&\" )^1/3 = \"","v":"Distance to 1 psi = 18 ( 0 )^1/3 = "},{"$f":"IF(E5=\"Condensed Phase Explosive\",ROUND(18*(N26)^0.333,1)&\"  m\",0)","v":0},null,null,null,null,null,null,null,"Low","Medium","High",{"$f":"\"Use Mach \"&AE22&\" for \"&IF(H30<>\"High\",V32,V31)&\"Fuel Reactivity and \"&IF(E47=\"Low\",W30,IF(E47=\"High\",Y30,X30))&\" Confinement\"","v":"Use Mach 0.5 for Low-Medium Fuel Reactivity and Medium Confinement"},null,null,null,"Liquid Density B",{"$f":"VLOOKUP(Chemical_3,Chemical_Table,COLUMN('Chemical Table'!Y1),FALSE)","v":{"$error":"#N/A"}}]
[null,null,null,null,null,"(Leave User Value Blank to accept Data Table Value)",null,null,null,null,null,null,null,null,null,null,null,null,null,null,null,"High ",0.5,">1",">1",null,null,null,null,"Boiling Point",{"$f":"VLOOKUP(Chemical_3,Chemical_Table,COLUMN('Chemical Table'!G1),FALSE)","v":{"$error":"#N/A"}},"C"]
[null,null,null,null,null,"Ideal Gas Vapor Density, rV (at Burst Temperature)",null,{"$f":"IF(OR(H27=\"\",H12=\"\"),\"\",ROUND(0.12*(H12+101.3)*H27/(273.15+H14),2))","v":""}," kg/m3",null,null,"From Graph, Scaled Distance, R = X / kgTNTeq1/3=",null,null,null,null,null,null,null,null,null,"Low-Medium ",0.35,0.5,1,null,null,null,null,"Liquid Density",{"$f":"1000*(AE29-AE30*IF(H14<>\"\",H14,AE31))","v":{"$error":"#N/A"}},"kg/m3"]
[null,null,null,null,null,null,null,null,null,null,null,null,{"$f":"H8&\" / ( \"&N26&\" )^1/3 = \"","v":"0 / ( 0 )^1/3 = "},{"$f":"IF(AND(E5=\"Condensed Phase Explosive\",N26>0),ROUND(H8/(N26)^0.333,2),0)","v":0}]
[null,"STEP 5 - Enter Information for Building or Head Space Explosion",null,null,null,null,null,null,{"$f":"IF($E$5<>\"Building or Head Space Explosion\",\"Skip Step\",\"\")","v":"Skip Step"},null,null,"Scaled Overpressure  =",null,{"$f":"IF(N33<=0,0,IF(EXP(160/(8.3+LN(N33))-17)>0.7,\"> 0.7\",ROUND(EXP(160/(8.3+LN(N33))-17),3)))","v":0},null,null,null,null,null,null,"Cloud Flammable Mass (equation 14-7, MFC = F Q XLFL / u  or  MFC = F Q* = "]
[null,null,null,"Building or Head Space Explosion Inputs:","Input Value","Input Units",null,"Equation Input",null,null,null,null,{"$f":"\"Overpressure at \"&H8&\" m  = \"","v":"Overpressure at 0 m  = "},{"$f":"IF(N34=0,0,IF(N34=\"> 0.7\",\"> 10\",ROUND(N34*14.7,1)))& \" psi   or\"","v":"0 psi   or"},{"$f":"IF(N34=0,0,IF(N34=\"> 0.7\",\"> 69\",ROUND(N34*101.3,1)))& \" kPa\"","v":"0 kPa"},null,null,null,null,null,null,null,null,null,{"$f":"IF(OR(E42=\"Instantaneous\",AND(H45<>0,H44*H43/H46>H45)),\"1.0 ( \"&H45&\" ) = \",\"1.0 ( \"&H44&\" ) ( \"&H43&\" ) / \"&H46&\" = \")","v":"1.0 ( 0 ) ( 0 ) / 3 = "},{"$f":"IF($E$5=\"Vapor Cloud Explosion\",IF(OR(E42=\"instantaneous\",AND(H45<>0,H44*H43/H46>H45)),ROUND(1*H45,0),ROUND(1*H44*H43/H46,0)),0)","v":0},"  kg"]
[null,null,"Building or Head Space Volume, VB",null,null,null,null,{"$f":"ROUND(E36*AE9,1)","v":0}," cu m",null,null,null,null,null,null,null,null,null,null,"  Distance to Explosion Epicenter, XEE= 0.5 XLFL=",null,null,null,null,{"$f":"\"0.5 ( \"&H43&\" ) = \"","v":"0.5 ( 0 ) = "},{"$f":"IF($E$5=\"Vapor Cloud Explosion\",ROUND(0.5*H43,1),0)","v":0},"  m"]
[null,null,"Degree of Internal Congestion",null,null," Assumed \"Medium\" if Blank",null,null,null,null,null,"MAXIMUM FRAGMENT RANGE",null,null,null,null,null,null,null,null,null,{"$f":"IF(45000*Z35>100000000,\"Potential Explosion energy limited to 100000000 kJ\",\"\")","v":""}]
[null,null,"1 D Confinement? (such as Fire Tube Boiler)",null,null," Assumed \"No\" if Blank",null,null,null,null,null,null,null,null,null,null,null,null,null,null,null,null,null,"Explosion Energy (equation 14-5), QE = 45000 MFC = ",null,null,"Note: PA = 101.3 kPa"]
[null,null,null,null,null,null,null,null,null,null,null,null,null,null,"Physical or Condensed Phase Explosion",null,null,null,null,null,null,{"$f":"\" 45000 kJ/kg ( \"&Z35&\" kg ) = \"","v":" 45000 kJ/kg ( 0 kg ) = "},{"$f":"IF(ROUND(45000*Z35,-1)<100000000,ROUND(45000*Z35,-1),100000000)","v":0}," kJ"]
[null,"STEP 6 - Enter Information for Vapor Cloud Explosion",null,null,null,null,null,null,{"$f":"IF($E$5<>\"Vapor Cloud Explosion\",\"Skip Step\",\"\")","v":"Skip Step"},null,null,null,null,null,null,null,null,null,null,null,"  Scaled Overpressure at 1 psi = 0.068"]
[null,"Vapor Cloud Explosion Inputs:",null,null,"Input Value","Input Units",null,"Equation Input",null,null,null,null,"Maximum Fragment Range = 120 kgTNTeq1/3   (equation 15-3)",null,null,null,null,null,null,null,null,null,"  Scaled Distance, R = X / (2 QE / P0 )1/3 = ",{"$f":"IF($E$5=\"Vapor Cloud Explosion\",IF(AE22=1,4.1,IF(AE22=0.5,2.5,IF(AE22=0.35,1.5,5))),0)","v":0}]
[null,null,"Type of Release",null,null,null," Assumed \"Continuous\" if Blank",null,null,null,null,null,null,null," Explosion Energy, TNTeq = ",{"$f":"IF(E5=\"Condensed Phase Explosive\",N26,N9)","v":0}," kg",null,null,null,"Distance to 1 psi = R (2 QE / P0 )1/3 + XEE ="]
[null,null,"Distance to LFL from Dispersion Model, XLFL",null,null,null,null,{"$f":"ROUND(E43*AE10,1)","v":0}," m",null,null,null,null,null,{"$f":"\"= 120 ( \"&P42&\" )^1/3 =\"","v":"= 120 ( 0 )^1/3 ="},{"$f":"IF(P42>0,ROUND(120*P42^(1/3),0)&\"  m\",\"\")","v":""},null,null,null,null,null,null,{"$f":"X41&\" [ 2 ( \"&W39&\" ) / 101.3 ]^1/3 + \"&Z36&\" = \"","v":"0 [ 2 ( 0 ) / 101.3 ]^1/3 + 0 = "},{"$f":"IF($E$5=\"Vapor Cloud Explosion\",ROUND(X41*(2*W39/101.3)^0.333+Z36,1)&\"  m\",0)","v":0}]
[null,null,"Vapor Rate",null,null,null,null,{"$f":"ROUND(E44*AE11,4)","v":0}," kg/sec"]
[null,null,"Total Vapor Released",null,null,null,null,{"$f":"IF(E45=\"\",0,ROUND(E45*AE12,2))","v":0}," kg",null,null,null,null,null,null,null,null,null,null,"   From Graph, Scaled Distance, R = ( X - XEE) / (2 QE / P0 )1/3 = "]
[null,null,"Wind Speed (Assumed 3 m/sec if Blank)",null,null,null,null,{"$f":"IF(E46=\"\",3,ROUND(E46*AE13,4))","v":3}," m/sec",null,null,null,null,null,null,null,null,null,null,null,null,null,{"$f":"\"( \"&H8&\" - \"&Z36&\" ) / [ 2 ( \"&W39&\" ) / 101.3 ]^1/3 = \"","v":"( 0 - 0 ) / [ 2 ( 0 ) / 101.3 ]^1/3 = "},{"$f":"IF(AND(E8>0,W39>0),IF(H8<Z36,0.01,ROUND((H8-Z36)/(2*W39/101.3)^0.333,3)),0)","v":0}]
[null,null,"Degree of Outdoor Congestion",null,null," Assumed \"Medium\" if Blank",null,null,null,null,null,null,null,null,null,null,null,null,null,null,"Scaled Overpressure  =",null,{"$f":"IF(AND(H8>0,$E$5=\"Vapor Cloud Explosion\"),IF(AE27>0.7,\"> 0.7\",ROUND(AE27,3)),0)","v":0}]
[null,null,null,null,null,null,null,null,null,null,null,null,null,null,null,null,null,null,null,null,null,{"$f":"\"Overpressure at \"&H8&\" m  = \"","v":"Overpressure at 0 m  = "},{"$f":"IF(W47=0,0,IF(W47<0.7,ROUND(W47*14.7,1)& \" psi   or\",\"> 10 psi   or\"))","v":0},{"$f":"IF(W47=0,0,IF(W47<0.7,ROUND(W47*101.3,1)& \" kPa\",\"> 69 kPa\"))","v":0}]
[null,null,null,null,null,null,null,null,null,null,null,null,null,null,null,null,null,null,null,null,null,null,null,{"$f":"IF(AND(H8>0,H8<Z36),\"Distance of Interest is less than the distance from leak source to explosion epicenter\",\"\")","v":""}]
[null,null,"Copyright © 2026"]
[null,null,"American Institute of Chemical Engineers"]

{"sheet":"Impact Assessment","index":7,"n_rows":98,"n_cols":39,"rows_kept":98,"cut":false,"hidden":false,"merged":[[72,1,72,2],[68,11,68,18],[69,11,69,14],[71,11,72,18],[48,8,48,9],[31,22,32,22],[31,23,32,23],[31,24,32,24],[31,25,32,25],[35,8,35,9],[36,8,36,9],[37,8,38,9],[43,8,44,9],[39,8,40,9],[41,8,41,9],[84,12,85,17],[70,21,70,24],[80,22,82,27],[78,11,78,18],[79,11,79,14],[80,11,81,18],[82,17,83,18],[1,11,1,18],[8,12,9,17],[2,11,2,14],[62,12,63,17],[1,21,1,28],[2,21,2,24],[31,12,32,17],[51,17,52,18],[55,12,56,17],[22,11,22,18],[46,21,47,28],[46,11,46,18],[47,11,47,14],[23,11,23,14],[39,12,40,17],[42,12,43,17],[26,17,27,18],[45,1,46,8],[39,4,39,5],[15,21,17,28],[4,4,4,5],[8,1,9,8],[6,8,7,8],[8,28,10,28],[5,4,5,6],[16,12,17,17],[13,2,13,6],[14,2,14,8],[40,27,41,29],[32,27,33,29],[5,21,6,28],[94,21,94,23],[94,24,94,26],[94,27,97,28],[20,20,20,23],[19,20,19,28],[55,21,55,28],[36,27,37,28],[87,21,87,28],[88,21,88,24],[90,21,92,28],[93,24,93,26],[61,27,62,28],[64,22,65,27],[69,21,69,28],[56,21,56,24],[58,21,59,28]]}
[null,null,null,null,null,null,null,null,null,null,null,null,null,null,null,null,null,null,null,null,null,null,null,null,null,null,null,null,null,null,null,"Vapor Correlation Exponent, b and a'",null,null,null,null,null,{"$f":"IF(AND(H63>0,H65>0),LN(H63/H65)/LN(AL5/AL6),0.6)","v":0.6},{"$f":"IF(AL6>0,H63/(1/AL6)^AL1,0)","v":0}]
[null,null,null,null,"ONSITE IMPACT ASSESSMENT INPUT INFORMATION",null,null,null,null,null,null,"OUTDOOR FLAMMABLE IMPACT",null,null,null,null,null,null,null,null,null,"OFFSITE OUTDOOR TOXIC RELEASE IMPACT",null,null,null,null,null,null,null,null,null,{"$f":"\"X = \"&ROUND(AM1,1)&\" [ 1 / C ]^ \"&ROUND(AL1,3)&\"  for 3 D weather\"","v":"X = 0 [ 1 / C ]^ 0.6  for 3 D weather"}]
[null,null,null,"Required Inputs are Shaded \"Yellow\"",null,null,null,null,null,null,null,null,null,null,null,null,null,null,null,null,null,null,null,null,null,null,null,null,null,null,null,"Vapor Correlation Exponent, b and a'",null,null,null,null,null,{"$f":"IF(AND(H64>0,H66>0),LN(H64/H66)/LN(AL5/AL6),0.4)","v":0.4},{"$f":"IF(AL6>0,H64/(1/AL6)^AL1,0)","v":0}]
[null,"STEP 1 - Select Location and Scenario Outcome",null,null,null,null,null,null,null,null,null,null,null,null,null,null,null,null,null,null,null,null,null,null,null,null,null,null,null,null,null,{"$f":"\"X = \"&ROUND(AM3,1)&\" [ 1 / C ]^ \"&ROUND(AL3,3)&\"  for 1.5 F weather\"","v":"X = 0 [ 1 / C ]^ 0.4  for 1.5 F weather"}]
[null,null,null,"Release Location ",null,null,"  (Assumed Outdoor if Blank)",null,null,null,null,"Flash Fire",null,null,null,null,null,null,null,null,null,"Time-Scaled ER-2 = ER-2 / Exposure Duration1/n =",null,null,null,null,{"$f":"H21&\" / ( \"&ROUND(H29,3)&\" )^(1/n) = \"","v":"0 / ( 1 )^(1/n) = "},{"$f":"IF(H29>0,H21/H29^(1/H24),H21)","v":0},"ppm",null,null,"Estimated LC1 Concentration",null,null,null,null,null,{"$f":"IF(H29>0,H22*H20/H29^(1/H24),H22*H20)","v":0},"ppm"]
[null,null,null,"Scenario Outcome ",null,null,null,{"$f":"IF(AND(E5=\"Indoor\",OR(E6=\"Vapor Cloud Explosion\",E6=\"BLEVE or Fireball\")),\" Only with Outdoor Location\",IF(AND(E5<>\"Indoor\",E6=\"Building Explosion\"),\" Only with Indoor Location\",\"\"))","v":""},null,null,null,{"$f":"\"Distance to 1/2 LFL of \"&ROUND(H62,1)&\" m \"&IF(H62<3,\"Does not Exceed\",\"Exceeds\")&\" 3 m Threshold for Severe Impact\"&IF(H62<3,\" athough Injury may occur.\",\".\")","v":"Distance to 1/2 LFL of 0 m Does not Exceed 3 m Threshold for Severe Impact athough Injury may occur."},null,null,null,null,null,null,null,null,null,{"$f":"\"Offsite Concentration of \"&ROUND(H56,1)&\" ppm \"&IF(AND(H56>AB5,AB5>0),\"Exceeds\",\"Does Not Exceed\")&\" Time-Scaled ER-2 Concentration of \"&ROUND(AB5,1)&\" ppm. \"&IF(AND(H56>AB5,AB5>0),\"Further Analysis Warranted.\",\"\")","v":"Offsite Concentration of 0 ppm Does Not Exceed Time-Scaled ER-2 Concentration of 0 ppm. "},null,null,null,null,null,null,null,null,null,"Estimated LC50 Concentration",null,null,null,null,null,{"$f":"IF(H29>0,H23*H20/H29^(1/H24),H23*H20)","v":0},"ppm"]
[null,null,null,null,null,null,null,"Equation Input","  (Assumed 1 if Blank)",null,null,null,null,null,null,null,"Impact Area  (Equation 15-1), = 0.3 XMultiple LFL2",null,null,null,null,null,null,null,null,null,null,null,null,null,null,"Lethality a coefficient (3 D)",null,null,null,null,null,{"$f":"IF(AL6<>0,IF(AL5/AL6=1,0,LN(0.01)-LN(0.02)/(1-(AL5/AL6)^(2*AL1))),0)","v":0}]
[null,null,null,null,"Number of Personnel Routinely in the Immediate Vicinity? ",null,null,{"$f":"IF(E$6=\"Offsite Toxic Release\",0,IF(F8=\"\",1,F8+0.000001))","v":1},null,null,null,null,null,null,{"$f":"\" = 0.3 ( \"&ROUND(H62,1)&\" )^2 =\"","v":" = 0.3 ( 0 )^2 ="},{"$f":"IF(AND(H62>=3,$E$5<>\"Indoor\",OR($E$6=\"Flash Fire\",$E$6=\"Vapor Cloud Explosion\")),0.3*H62^2,0)","v":0}," m2",null,null,null,null,{"$f":"IF(AND(H63>0,H64>0,H65>0,H66>0,AC15<0.1),\"Severe Offsite Toxic Impact Unlikely - Consider Minor Impacts such as Irritation or Objectionable Odor in Evaluation\",\"\")","v":""},null,null,null,null,null,null,null,null,null,"Lethality b coefficient (3 D)",null,null,null,null,null,{"$f":"IF(AL5<>0,(LN(0.01)-AL7)*AL5^(2*AL1),0)","v":0}]
[null,"Personnel in the Immediate Vicinity include those associated with procedures requiring operator attendance such as unloading a tank truck, sampling, in addition to personnel using nearby walkways, etc.",null,null,null,null,null,null,null,null,null,null,"Flash Fire Personnel Seriously Impacted, N = Impact Area times Population Density plus Personnel in Immediate Area",null,null,null,null,null,null,null,null,null,null,null,null,"Lethality times Area (Outdoors 3 D)",{"$f":"ROUND(AL17+AL19,0)","v":0},null,"(Equations 15-14 to\n15-18)",null,null,"Lethality a coefficient (1.5 F)",null,null,null,null,null,{"$f":"IF(AL6<>0,IF(AL5/AL6=1,0,LN(0.01)-LN(0.02)/(1-(AL5/AL6)^(2*AL3))),0)","v":0}]
[null,null,null,null,null,null,null,null,null,null,null,null,null,null,null,null,null,null,null,null,null,null,null,null,null,"Lethality times Area (Indoors 3 D)",{"$f":"ROUND(AL18+AL20,0)","v":0},null,null,null,null,"Lethality b coefficient (1.5 F)",null,null,null,null,null,{"$f":"IF(AL5<>0,(LN(0.01)-AL9)*AL5^(2*AL3),0)","v":0}]
[null,null,null,null,null,null,null,null,null,null,null,null,null,null,null,null,{"$f":" \"N = ( \"&P8&\" sq m ) \"&H45&\" people/sq m + \"&H8&\" = \"","v":"N = ( 0 sq m ) 0.0002 people/sq m + 1 = "},{"$f":"IF(P8=0,0,P8*H45+H8)","v":0},null,null,null,null,null,null,null,"Lethality times Area (Outdoors 1.5 f)",{"$f":"ROUND(AL21+AL23,0)","v":0},null,null,null,null,"Concentration at Lethality Limit=1 (3 D)",null,null,null,null,null,{"$f":"MIN(1000000,IF(AL7>0,(-AL8/AL7)^(1/(2*AL1)),0))","v":0},"ppm"]
[null,"STEP 2 - Enter Chemical Properties (or Select Chemical Name from Pic List)",null,null,null,null,null,null,null,null,null,null,null,null,null,null,null,null,null,null,null,null,null,null,null,"Lethality times Area (Indoors 1.5 F)",{"$f":"ROUND(AL22+AL24,0)","v":0},null,null,null,null,"Concentration at Lethality Limit=1 (1.5 F)",null,null,null,null,null,{"$f":"MIN(1000000,IF(AL9>0,(-AL10/AL9)^(1/(2*AL3)),0))","v":0},"ppm"]
[null,null,null,null,null,null,null,"Cas No.",null,null,null,"Vapor Cloud Explosion (VCE)",null,null,null,null,null,null,null,null,"  N = Population Density * { (1 - Fract 1.5 F) [ Fract Outdoors * Lethality times Area Outdoor 3 D + ( 1 - Fract Outdoors ) * Lethality times Area Indoor 3 D ) ]",null,null,null,null,null,null,null,null,null,null,"Distance to Lethality Limit (Outdoors 3D",null,null,null,null,null,{"$f":"IF(AND(AL11>0,AL6>0),(AL6/AL11)^AL1*H63,0)","v":0},"m"]
[null,"Chemical Name ",null,null,null,null,null,{"$f":"IF(Chemical_4=\"\",\"\",VLOOKUP(Chemical_4,Chemical_Table,COLUMN('Chemical Table'!B1),FALSE))","v":""},null,null,null,{"$f":"\"Total Airborne Release of \"&IF(H30=0,\"Unlimited\",H30)&\" Kg \"&IF(OR(H30=0,AND(H19<>\"High\",H30>=1000),AND(H19=\"High\",H30>=100)),\"Exceeds \",\"Does not Exceed \")&IF(H19=\"High\",10,100)&\" Kg Thresold for Vapor Cloud Explosion\"","v":"Total Airborne Release of Unlimited Kg Exceeds 100 Kg Thresold for Vapor Cloud Explosion"},null,null,null,null,null,null,null,null,null,null," + Fract 1.5 F * [ Fract Outdoors * Lethality times Area Outdoor 1.5 F + ( 1 - Fract Outdoors ) * Lethality times Area Indoor 1.5 F ) ] }",null,null,null,null,null,null,null,null,"Distance to Lethality Limit (Indoors 3 D)",null,null,null,null,null,{"$f":"IF(AND(AL11>0,AL6>0),(H25*AL6/AL11)^AL1*H63,0)","v":0},"m"]
[null,null,null,null,null,null,null,null,null,null,null,{"$f":"\"Overpressure at Nearest Wall of \"&IF(H58>H59,H58,H59)&\" psi \"&IF(OR(H58>IF(E40=\"Low Strength\",0.5,IF(E40=\"Structural Frame\",1.4,1)),H59>IF(E40=\"Low Strength\",0.5,IF(E40=\"Structural Frame\",1.4,1))),\"Exceeds \",\"Does not Exceed \")&IF(E40=\"Low Strength\",0.5,IF(E40=\"Structural Frame\",1.4,1))&\" psi Thresold for Building Damage\"","v":"Overpressure at Nearest Wall of 0 psi Does not Exceed 1 psi Thresold for Building Damage"},null,null,null,null,null,null,null,null,{"$f":"\"  N = \"&H38&\" people/sq m { \"&1-H37&\" [ \"&H36&\" (\"&ROUND(AA9,0)&\") + \"&1-H36&\" (\"&ROUND(AA10,0)&\" ] + \"&H37&\" [ \"&H36&\" (\"&ROUND(AA11,0)&\") + \"&1-H36&\" (\"&ROUND(AA12,0)&\") ] sq m } =\"","v":"  N = 0.0015 people/sq m { 0.8 [ 0.1 (0) + 0.9 (0 ] + 0.2 [ 0.1 (0) + 0.9 (0) ] sq m } ="},null,null,null,null,null,null,null,{"$f":"IF(OR(H63>0,H64>0,H65>0,H66>0),ROUND(H38*((1-H37)*(H36*AA9+(1-H36)*AA10)+H37*(H36*AA11+(1-H36)*AA12)),1),0)","v":0},null,null,"Distance to Lethality Limit (Outdoors 1.5 F)",null,null,null,null,null,{"$f":"IF(AND(AL12>0,AL6>0),(AL6/AL12)^AL3*H64,0)","v":0},"m"]
[null,null,null,null,"(Leave Input Value Blank to accept Chemical Data Table Values)",null,null,null,null,null,null,null,null,null,null,null,null,{"$f":"\"Impact to \"&$E$40&\" Occupied Building (Figure 15.11), Vulnerability = \"","v":"Impact to  Occupied Building (Figure 15.11), Vulnerability = "},{"$f":"IF(AND($E$5<>\"Indoor\",$E$6=\"Vapor Cloud Explosion\",OR(H30=0,AND(H19<>\"High\",H30>=100),AND(H19=\"High\",H30>=10)),OR(H58>IF(E40=\"Low Strength\",0.5,IF(E40=\"Structural Frame\",1.4,1)),H59>IF(E40=\"Low Strength\",0.5,1))),ROUND(EXP(-4.5*(IF(E40=\"Low Strength\",0.5,IF(E40=\"Structural Frame\",1.4,1))/IF(H59=0,H58,H59))^2)+0.01,3),0)","v":0},null,null,{"$f":"\"Based on continuous release, \"&H36&\" fraction of total population outdoors, \"&H37&\" fraction of time at 1.5 m/sec class F atmospheric stability, and \"&1-H37&\" fraction of time at 3 m/sec class D atmospheric stability.\"","v":"Based on continuous release, 0.1 fraction of total population outdoors, 0.2 fraction of time at 1.5 m/sec class F atmospheric stability, and 0.8 fraction of time at 3 m/sec class D atmospheric stability."},null,null,null,null,null,null,null,null,null,"Distance to Lethality Limit (Indoors 1.5 F)",null,null,null,null,null,{"$f":"IF(AND(AL11>0,AL6>0),(H25*AL6/AL11)^AL3*H64,0)","v":0},"m"]
[null,null,null,null,"Data Table Value","Input Value",null,"Equation Input",null,null,null,null,{"$f":"\"Number of Building Occupants Severely Impacted = Vulnerability times Total Building Occupants = \"","v":"Number of Building Occupants Severely Impacted = Vulnerability times Total Building Occupants = "},null,null,null,null,null,null,null,null,null,null,null,null,null,null,null,null,null,null,"Lethality times Area within Initial Area (Outdoors 3 D)",null,null,null,null,null,{"$f":"IF(H56>AB5,MAX(0,0.25*(AL13^2-H35^2)),0)","v":0},"m2"]
[null,null,null,"Lower Flammable Limit, LFL ",{"$f":"IF(Chemical_4=\"\",\"\",VLOOKUP(Chemical_4,Chemical_Table,COLUMN('Chemical Table'!J1),FALSE))","v":""},null,null,{"$f":"IF(AND(E18=\"\",F18=\"\"),0,IF(F18=\"\",E18,F18))","v":0}," vol %",null,null,null,null,null,null,null,null,null,null,null,null,null,null,null,null,null,null,null,null,null,null,"Lethality times Area within Initial Area (Indoors 3 D)",null,null,null,null,null,{"$f":"IF(H56>AB5,MAX(0,0.25*(AL14^2-H35^2)),0)","v":0},"m2"]
[null,null,null,"Fuel Reactivity based on Fundamental Burning Velocity ",{"$f":"IF(Chemical_4=\"\",\"\",VLOOKUP(Chemical_4,Chemical_Table,COLUMN('Chemical Table'!S1),FALSE))","v":""},null,null,{"$f":"IF(AND(E19=\"\",F19=\"\"),\"Medium\",IF(F19=\"\",E19,F19))","v":"Medium"},null,null,null,null,null,null,null,{"$f":"\"N = \"&S16&\" ( \"&F43&\" ) = \"","v":"N = 0 (  ) = "},{"$f":"ROUND(S16*F43,3)","v":0},null,null,null,null,null,null,null,null,null,null,null,null,null,null,"Integral of Lethality times Area beyond Initial Area (Outdoors 3 D)",null,null,null,null,null,{"$f":"IF(H56>AB5,0.5*0.25*AL6^(2*AL1)*H63^2*(0-EXP(AL7+AL8*(MAX(H35,AL13)^2/(AL6^(2*AL1)*H63^2))))/AL8,0)","v":0},"m2"]
[null,null,null,"ERPG-3 Concentration ",{"$f":"IF(Chemical_4=\"\",\"\",VLOOKUP(Chemical_4,Chemical_Table,COLUMN('Chemical Table'!F1),FALSE))","v":""},null,null,{"$f":"IF(AND(E20=\"\",F20=\"\"),0,IF(F20=\"\",E20,F20))","v":0}," ppm",null,null,null,null,null,null,null,null,"Total Personnel Severely Impacted = Flash Fire + Occupants Impacted = ",{"$f":"R11+Q19","v":0},null,"ONSITE OUTDOOR TOXIC RELEASE IMPACT",null,null,null,null,null,null,null,null,null,null,"Integral of Lethality times Area beyond Initial Area (Indoors 3 D)",null,null,null,null,null,{"$f":"IF(H56>AB5,0.5*0.25*AL6^(2*AL1)*((H25^AL1)*H63)^2*(0-EXP(AL7+AL8*(MAX(H35,AL14)^2/(AL6^(2*AL1)*((H25^AL1)*H63)^2))))/AL8,0)","v":0},"m2"]
[null,null,null,"ERPG-2 Concentration ",{"$f":"IF(Chemical_4=\"\",\"\",VLOOKUP(Chemical_4,Chemical_Table,COLUMN('Chemical Table'!E1),FALSE))","v":""},null,null,{"$f":"IF(AND(E21=\"\",F21=\"\"),0,IF(F21=\"\",E21,F21))","v":0}," ppm",null,null,null,null,null,null,null,null,null,null,null,null,null,null,null,null,null,null,null,null,null,null,"Lethality times Area within Initial Area (Outdoors 1.5 F)",null,null,null,null,null,{"$f":"IF(H56>AB5,MAX(0,0.25*(AL15^2-H35^2)),0)","v":0},"m2"]
[null,null,null,"LC1 as Multiple of EPPG-3 Concentration ",2,null,null,{"$f":"IF(F22=\"\",E22,F22)","v":2},"typically 1 to 2",null,null,null,null,null,null,null,null,null,null,null,null,null,null,null,null,null,null,null,null,null,null,"Lethality times Area within Initial Area (Indoors 1.5 F)",null,null,null,null,null,{"$f":"IF(H56>AB5,MAX(0,0.25*(AL16^2-H35^2)),0)","v":0},"m2"]
[null,null,null,"LC50 as Multiple of EPPG-3 Concentration ",5,null,null,5,"typically 3 to 5",null,null,"INDOOR FLAMMABLE IMPACT",null,null,null,null,null,null,null,null,null,"Outdoor Onsite Impact",null,null,null,null,null,null,null,null,null,"Integral of Lethality times Area beyond Initial Area (Outdoors 1.5 )",null,null,null,null,null,{"$f":"IF(H56>AB5,0.5*0.25*AL6^(2*AL3)*H64^2*(0-EXP(AL9+AL10*(MAX(H35,AL15)^2/(AL6^(2*AL3)*H64^2))))/AL10,0)","v":0},"m2"]
[null,null,null,"Dose Exponent ",2,null,null,{"$f":"IF(F24=\"\",E24,F24)","v":2},"typically 1 to 2",null,null,null,null,null,null,null,null,null,null,null,null,{"$f":"\"Distance to Multiple of ER-3 of \"&H63&\" m \"&IF(H63<3,\"Does not Exceed\",\"Exceeds\")&\" 3 m Threshold for Severe Impact \"&IF(H63<3,\"athough Injury may occur.\",\".\")","v":"Distance to Multiple of ER-3 of 0 m Does not Exceed 3 m Threshold for Severe Impact athough Injury may occur."},null,null,null,null,null,null,null,null,null,"Integral of Lethality times Area beyond Initial Area (Indoors 1.5 F)",null,null,null,null,null,{"$f":"IF(H56>AB5,0.5*0.25*AL6^(2*AL3)*((H25^AL3)*H64)^2*(0-EXP(AL9+AL10*(MAX(H35,AL16)^2/(AL6^(2*AL3)*((H25^AL3)*H64)^2))))/AL10,0)","v":0},"m2"]
[null,null,null,"Fraction Indoor/Outdoor Concentration ",0.5,null,null,{"$f":"IF(F25=\"\",E25,F25)","v":0.5},"typically 0.2 to 0.5",null,null,null,null,null,null,null,null,null,null,null,null,null,null,null,null,null,"Impact Area  (Equation 15-1), = 0.3 XLC-502"]
[null,null,null,"Dermal Toxicity Risk Phrase ",{"$f":"IF(Chemical_4=\"\",\"\",VLOOKUP(Chemical_4,Chemical_Table,COLUMN('Chemical Table'!T1),FALSE))","v":""},null,null,{"$f":"IF(AND(E26=\"\",F26=\"\"),0,IF(F26=\"\",E26,F26))","v":0},null,null,null,"Flash Fire",null,null,null,null,null,null,null,null,null,null,null,null,{"$f":"\" = 0.3 ( \"&ROUND(H63,1)&\" )^2 =\"","v":" = 0.3 ( 0 )^2 ="},{"$f":"IF(AND(E5<>\"Indoor\",E6=\"Onsite Toxic Release\"),0.3*H63^2,0)","v":0}," m2"]
[null,null,null,null,"Does Process Temperature Represent a Thermal Hazard? ",null,null,null,null,null,null,null,null,null,null,null,"Impact Area  (Equation 15-2), = VBldg2/3 Cindoor / 1/2 LFL",{"$f":"IF(H18=0,\"\",IF(0.0004*H70/H18>1,\"Limited to entire Enclosed Area\",\"\"))","v":""},null,null,null,"Personnel Seriously Impacted, N = Impact Area times Population Density plus Personnel in Immediate Area"]
[null,null,null,null,"Input Value","Input Units",null,"Equation Input"," Equation Units",null,null,null,null,null,{"$f":"\" = 0.0004 ( \"&H48&\" )^2/3 ( \"&H70&\" ppm / \"&H18&\" vol% ) =\"","v":" = 0.0004 ( 0 )^2/3 ( 0 ppm / 0 vol% ) ="},{"$f":"IF(AND($E$5=\"Indoor\",H18>0,OR($E$6=\"Flash Fire\",$E$6=\"Building Explosion\")),IF(0.0002*H70/H18<1,ROUND(0.0002*H48^0.667*H70/H18,1),ROUND(H48^0.667,1)),0)","v":0}," m2",null,null,null,null,null,null,null,null,null,{"$f":"\"N = ( \"&Z26&\" sq m ) \"&H45&\" people/sq m + \"&IF(H8<0.001,0,H8)&\" = \"","v":"N = ( 0 sq m ) 0.0002 people/sq m + 1 = "},{"$f":"IF(Z26=0,0,ROUND(Z26*H45+H8,3))","v":0}]
[null,null,null,"Release or Exposure Duration (leave blank if not limited)",null,null,null,{"$f":"IF(E29=\"\",1,IF(F29=\"sec\",E29/3600,IF(F29=\"min\",E29/60,E29)))","v":1}," hr",null,null,{"$f":"\"Impact Area of \"&ROUND(P28,1)&\" sq m \"&IF(P28<3,\"Does not Indicate\",\"Indicates\")&\" Potential for Severe Impact\"&IF(P28<3,\" although Injury may occur.\",\".\")","v":"Impact Area of 0 sq m Does not Indicate Potential for Severe Impact although Injury may occur."}]
[null,null,null,"Total Airborne Quantity, AQTotal ",null,null,null,{"$f":"IF(F30=\"lb\",ROUND(E30/2.2,1),E30)","v":0}," kg",null,null,null,null,null,null,null,"Indoor Population Density = Max. Personnel within Enclosed Area / VBldg2/3",null,null,null,null,"Occupied Building Impact - Toxic Infiltration"]
[null,null,null,null,null,null,null,null,null,null,null,null,null,null,{"$f":"\"N = ( \"&H49&\" - \"&H8&\" ) / (\"&H48&\")^2/3 = \"","v":"N = ( 2 - 1 ) / (0)^2/3 = "},{"$f":"IF(P28<3,0,IF(H49>H8,ROUND((H49-H8)/H48^0.667,4),0))","v":0}," people/m2",null,null,null,null,null,null,null,null,"Average Indoor Concentration (per Equation 13-36), ","CIndoor = COutdoor (1 = e-VR tD/2) "]
[null,null,null,null,null,null,null,null,null,null,null,null,"Flash Fire Personnel Seriously Impacted, N = Impact Area times Population Density plus Personnel in Immediate Area",null,null,null,null,null,null,null,null,null,"Time\nhour","Concentration\nduring Release","Concentration","Average Concentration"]
[null,"STEP 3 - Enter Plant Layout Information",null,null,null,null,null,null,null,null,null,null,null,null,null,null,null,null,null,null,null,null,null,null,null,null,null,"Average Concentration (by summation of time increments) = "]
[null,null,null,null,"Input Value","Input Units",null,"Equation Input"," Equation Units",null,null,null,null,null,null,{"$f":" \"N = ( \"&P28&\" sq m ) \"&P31&\" people/sq m + \"&H8&\" = \"","v":"N = ( 0 sq m ) 0 people/sq m + 1 = "},{"$f":"IF(AND($E$5=\"Indoor\",OR($E$6=\"Flash Fire\",$E$6=\"Building Explosion\")),IF(P28*P31+H8<H49,ROUND(P28*P31+H8,2),ROUND(MAX(H8,H49),2)),0)","v":0},null,null,null,null,null,0,0,0]
[null,null,null,"Distance to Property Limit or Offsite Population (Fence Line) ",null,null,null,{"$f":"IF(F35=\"ft\",ROUND(E35/3.281,0),E35)","v":0},"m",null,null,null,null,null,null,null,null,null,null,null,null,null,0.01,{"$f":"$H$57*(1-EXP(-$H$42*W35))","v":0},{"$f":"IF($H$29>=W35,X35,1)","v":0},{"$f":"(W35-W34)*(Y34+Y35)/2","v":0},null,{"$f":"Z46","v":0}," ppm"]
[null,null,null,null,"Fraction of Offsite Population Outdoors ",null,null,{"$f":"IF(F36=\"\",0.1,F36)","v":0.1},"(Assumed 0.1 if Blank)",null,null,"Building Explosion",null,null,null,null,null,null,null,null,null,null,0.02,{"$f":"$H$57*(1-EXP(-$H$42*W36))","v":0},{"$f":"IF($H$29>=W36,X36,Y35/(1+$H$42*(W36-W35)))","v":0},{"$f":"(W36-W35)*(Y35+Y36)/2","v":0}]
[null,null,null,null,"Fraction of time for Night Weather ",null,null,{"$f":"IF(F37=\"\",0.2,F37)","v":0.2},"(Assumed 0.2 if Blank)",null,null,{"$f":"\"Avg Concentration within the Enclosed Process Area of \"&H70&\" ppm\"&IF(H70>=10000*H18,\" Exceeds \",\" Does not Exceed \")&\"the LFL Threshold.\"","v":"Avg Concentration within the Enclosed Process Area of 0 ppm Exceeds the LFL Threshold."},null,null,null,null,null,null,null,null,null,null,0.05,0,0,0,null,{"$f":"\"Based on Release Duration of \"&H29&\" hour\"","v":"Based on Release Duration of 1 hour"}]
[null,null,null,"Offsite Population Density ",null,null,null,{"$f":"IF(E38=\"\",0.0015,IF(F38=\"people/sq ft\",ROUND(E38/10.764,5),E38))","v":1.5E-3},"(Assumed 0.0015 people/m2 if Blank)",null,null,{"$f":"\"Overpressure at Nearest Wall of \"&IF(H58>H59,H58,H59)&\" psi \"&IF(OR(H58>IF(E40=\"Low Strength\",0.5,IF(E40=\"Structural Frame\",1.4,1)),H59>IF(E40=\"Low Strength\",0.5,IF(E40=\"Structural Frame\",1.4,1))),\"Exceeds \",\"Does not Exceed \")&IF(E40=\"Low Strength\",0.5,IF(E40=\"Structural Frame\",1.4,1))&\" psi Thresold for Building Damage\"","v":"Overpressure at Nearest Wall of 0 psi Does not Exceed 1 psi Thresold for Building Damage"},null,null,null,null,null,null,null,null,null,null,0.1,0,0,0]
[null,null,null,null,null,null,null,null,null,null,null,null,null,null,null,null,null,{"$f":"\"Impact to \"&E40&\" Occupied Building (Figure 15-11, Vulnerability = \"","v":"Impact to  Occupied Building (Figure 15-11, Vulnerability = "},{"$f":"IF(AND($E$5=\"Indoor\",$E$6=\"Building Explosion\",H70>=10000*H18,OR(H58>IF(E40=\"Low Strength\",0.5,IF(E40=\"Structural Frame\",1.4,1)),H59>IF(E40=\"Low Strength\",0.5,IF(E40=\"Structural Frame\",1.4,1)))),ROUND(EXP(-4.5*(IF(E40=\"Low Strength\",0.5,1)/IF(H59=0,H58,H59))^2)+0.01,3),0)","v":0},null,null,null,0.2,0,0,0]
[null,null,null,"Occupied Building Type ",null,null,null,null,"(Assumed Typical Construction if Blank)",null,null,null,{"$f":"\"Number of Building Occupants Severely Impacted = Vulnerability times Total Building Occupants = \"","v":"Number of Building Occupants Severely Impacted = Vulnerability times Total Building Occupants = "},null,null,null,null,null,null,null,null,null,0.3,0,0,0]
[null,null,null,null,"Fraction of Offsite Impact Area Containing Occupied Buildings ",null,null,{"$f":"IF(F41=\"\",0.5,F41)","v":0.5},null,null,null,null,null,null,null,null,null,null,null,null,null,null,0.4,0,0,0,null,"Estimate Average d using Equation 13-36 at t = Release Duration / 2"]
[null,null,null,null,"Ventilation Rate of Occupied Building (air changes / hour) ",null,null,{"$f":"IF(F42=\"\",3,F42)","v":3},"(Assumed 3 if Blank)",null,null,null,null,null,null,{"$f":"\"N = \"&S39&\" ( \"&F43&\" ) = \"","v":"N = 0 (  ) = "},{"$f":"ROUND(S39*F43,3)","v":0},null,null,null,null,null,0.5,0,0,0]
[null,null,null,null," Maximum Number of Occupants in Occupied Building ",null,null,null,null,null,null,null,"Total Personnel Severely Impacted = Personnel within Enclosed Process Area + Occupants Impacted = ",null,null,null,null,null,null,null,null,null,0.6,0,{"$f":"IF($H$29>=W43,X43,Y42/(1+$H$42*(W43-W42)))","v":0},0,null,{"$f":"$H$57*(1-EXP(-$H$42*H29/2))","v":0}," ppm"]
[null,null,null,null,null,null,null,null,"(Assumed 0.0002 people/m2 if Blank)",null,null,null,null,null,null,null,null,null,{"$f":"Q34+Q42","v":0},null,null,null,0.8,0,{"$f":"IF($H$29>=W44,X44,Y43/(1+$H$42*(W44-W43)))","v":0},0]
[null,null,null,"Onsite Outdoor Population Density ",null,null,null,{"$f":"IF(E45=\"\",0.0002,IF(F45=\"people/sq ft\",ROUND(E45/10.764,5),E45))","v":2.0000000000000001E-4},null,null,null,null,null,null,null,null,null,null,null,null,null,null,1,0,0,0]
[null,"Outdoor Population Density should account for maintenance and other personnel who may occasionally be in nearby outdoor process areas.  ",null,null,null,null,null,null,null,null,null,null,null,null,null,null,null,null,null,null,null,null,null,null,"Average = ",{"$f":"SUM(Z35:Z45)","v":0}]
[null,null,null,null,null,null,null,null,null,null,null,"PHYSICAL EXPLOSION IMPACT",null,null,null,null,null,null,null,null,null,{"$f":"\"Estimated Indoor Concenntration of \"&ROUND(Z46,1)&\" ppm \"&IF(Z46<H20,\"Does not Exceed\",\"Exceeds\")&\" ER-3 of \"&H20&\" ppm Threshold for Severe Impact\"&IF(Z46<H20,\" athough Injury may occur.\",\".\")","v":"Estimated Indoor Concenntration of 0 ppm Exceeds ER-3 of 0 ppm Threshold for Severe Impact."}]
[null,null,null,"Enclosed Process Area Volume, VBldg ",null,null,null,{"$f":"IF(F48=\"cu ft\",ROUND(E48/35.315,2),E48)","v":0},"cu m"]
[null,null,null,null," Maximum Number of Personnel within Enclosed Process Area ",null,null,{"$f":"IF(F49=\"\",2,F49)","v":2},"(Assumed 2 if Blank)",null,null,null,null,null,null,null,null,null,null,null,null,null,null,null,{"$f":"\"Average Concentration = \"&ROUND(Z46,1)&\" / \"&ROUND(H20,1)&\" = \"","v":"Average Concentration = 0 / 0 = "},{"$f":"IF(AND(E5<>\"Indoor\",E6=\"Onsite Toxic Release\"),ROUND(Z46/H20,1),0)","v":0}," times ER-3"]
[null,null,null,null,null,null,null,null,null,null,null,"Direct Explosion Impact",null,null,null,null,null,null,null,null,null,null,null,null,null,null,null,{"$f":"\"Impact to Occupied Building (Figure 15.9), Vulnerability = \"","v":"Impact to Occupied Building (Figure 15.9), Vulnerability = "},{"$f":"IF(Z49>1,MIN(1,ROUND(EXP(-4.605+3.912/(1-H22/H23)+3.912/(1/H23-1/H22)/Z49),3)),0)","v":0}]
[null,null,null,"Dike or Spill Containment Area ",null,null,null,{"$f":"IF(F51=\"sq ft\",ROUND(E51/10.764,2),E51)","v":0},"sq m",null,null,{"$f":"\"Distance to Blast Impact of \"&H67&\" m \"&IF(H67<1,\"Does not Exceed\",\"Exceeds\")&\" 1 m Threshold for Severe Impact \"&IF(H111<3,\"athough Injury may occur.\",\".\")","v":"Distance to Blast Impact of 0 m Does not Exceed 1 m Threshold for Severe Impact athough Injury may occur."},null,null,null,null,null,null,null,null,null,"     Number of Building Occupants Severely Impacted = Vulnerability times Total Building Occupants = "]
[null,null,null,null,null,null,null,null,null,null,null,null,null,null,null,null,"Direct Blast Impact Area, = p Xexpl2",{"$f":"IF(H18=0,\"\",IF(AND(E5=\"Indoor\",0.0004*H70/H18>1),\"Limited to entire Enclosed Area\",\"\"))","v":""},null,null,null,null,null,null,null,{"$f":"\"N = \"&ROUND(AC50,3)&\" ( \"&F43&\" ) = \"","v":"N = 0 (  ) = "},{"$f":"ROUND(AC50*F43,3)","v":0}]
[null,null,null,null,null,null,null,null,null,null,null,null,null,null,{"$f":"\" = 3.14 ( \"&ROUND(H67,1)&\" )^2 =\"","v":" = 3.14 ( 0 )^2 ="},{"$f":"IF(AND(H67>=1,E6=\"Physical Explosion\"),3.14*H67^2,0)","v":0}," m2",null,null,null,null,null,null,null,null,null,null,"Total Personnel Severely Impacted = Outdoor Onsite + Occupants Impacted = ",{"$f":"AB28+AA52","v":0}]
[null,"STEP 4 - Enter Hazard Distances",null,null,null,null,null,null,null,null,null,null,null,null,"Fragment Area = Fragment Range times width times number fragments"]
[null,null,null,null,"Input Value","Input Units",null,"Equation Input"," Equation Units",null,null,null,null,null,{"$f":"ROUND(H68,1)&\" ( 1 m) \"&H69&\" =\"","v":"0 ( 1 m) 0 ="},{"$f":"H68*H69","v":0}," m2"]
[null,null,null,"Concentration at Distance to Fence Line or Public ",null,null,null,{"$f":"IF(F56=\"Vol %\",E56*10000,E56)","v":0},"ppm",null,null,null,"Direct Explosion Personnel Seriously Impacted, N = Impact Area times Population Density plus Personnel in Immediate Area",null,null,null,null,null,null,null,null,"TOXIC RELEASE IMPACT WITHIN ENCLOSED PROCESS AREA"]
[null,null,null,"Concentration at Distance to Occupied Building ",null,null,null,{"$f":"IF(F57=\"Vol %\",E57*10000,E57)","v":0},"ppm"]
[null,null,null,"Explosion Overpressure at Distance to Occupied Building ",null,null,null,{"$f":"IF(F58=\"kPa\",ROUND(E58/6.895,2),E58)","v":0},"psi",null,null,null,null,null,null,null,{"$f":" \"N = ( \"&P53&\" + \"&P55&\" sq m ) \"&IF(E5=\"Indoor\",IF(H48>0,ROUND((H49-H8)/H48^2/3,1),0),H45)&\" people/sq m + \"&H8&\" = \"","v":"N = ( 0 + 0 sq m ) 0.0002 people/sq m + 1 = "},{"$f":"IF(E6=\"Physical Explosion\",(P53+P55)*IF(E5=\"Indoor\",IF(H48>0,(H49-H8)/H48^0.667,0),H45)+H8,0)","v":0}]
[null,null,null,"Explosion Overpressure at Center of Occupied Building ",null,null,null,{"$f":"IF(F59=\"kPa\",ROUND(E59/6.895,2),E59)","v":0},"psi",null,null,null,null,null,null,null,null,null,null,null,null,{"$f":"\"Average Indoor Concentration of \"&ROUND(H70,1)&\" ppm \"&IF(H70<H20,\"Does not Exceed\",\"Exceeds\")&\" ERPG-3 of \"&ROUND(H20,1)&\" ppm Threshold for Severe Impact\"&IF(H70<H20,\" athough Injury may occur.\",\".\")","v":"Average Indoor Concentration of 0 ppm Exceeds ERPG-3 of 0 ppm Threshold for Severe Impact."}]
[null,null,null,"Distance to 1 psi Overpressure ",null,null,null,{"$f":"IF(F60=\"ft\",ROUND(E60/3.281,0),E60)","v":0},"m",null,null,"Occupied Building Impact"]
[null,null,null,"Spray Distance ",null,null,null,0,"m",null,null,{"$f":"\"Overpressure at Nearest Wall of \"&IF(H58>H59,ROUND(H58,1),ROUND(H59,1))&\" psi \"&IF(OR(H58>IF(E40=\"Low Strength\",0.5,IF(E40=\"Structural Frame\",1.4,1)),H59>IF(E40=\"Low Strength\",0.5,IF(E40=\"Structural Frame\",1.4,1))),\"Exceeds \",\"Does not Exceed \")&IF(E40=\"Low Strength\",0.5,IF(E40=\"Structural Frame\",1.4,1))&\" psi Thresold for Building Damage\"","v":"Overpressure at Nearest Wall of 0 psi Does not Exceed 1 psi Thresold for Building Damage"},null,null,null,null,null,null,null,null,null,null,null,null,null,null,"Impact Area  (Equation 15-2), = VBldg2/3 Cindoor / LC-50 ",{"$f":"\" (using \"&H23&\" times ERPG-3)\"","v":" (using 5 times ERPG-3)"}]
[null,null,null,"Distance to Multiple of Lower Flammable Limit ",null,null,null,0,"m",null,null,null,null,null,null,null,null,{"$f":"\"Impact to \"&$E$40&\" Occupied Building (Figure 15-11), Vulnerability = \"","v":"Impact to  Occupied Building (Figure 15-11), Vulnerability = "},{"$f":"IF(AND(E6=\"Physical Explosion\",OR(H58>IF(E40=\"Structural Frame\",1.4,IF(E40=\"Low Strength\",0.5,1)),H59>IF(E40=\"Structural Frame\",1.4,IF(E40=\"Low Strength\",0.5,1)))),ROUND(EXP(-4.5*(IF(E40=\"Structural Frame\",1.4,IF(E40=\"Low Strength\",0.5,1))/IF(H59=0,H58,H59))^2)+0.02,3),0)","v":0},null,null,null,null,null,{"$f":"\" =  ( \"&H48&\" )^2/3 ( \"&H70&\" ppm / ( \"&H23&\" * \"&H20&\" ppm ) ) =\"","v":" =  ( 0 )^2/3 ( 0 ppm / ( 5 * 0 ppm ) ) ="},{"$f":"IF(AND(E5=\"Indoor\",E6=\"Onsite Toxic Release\",H23>0,H20>0),IF(H70/(H23*H20)<1,ROUND(H48^0.667*H70/(H23*H20),1),ROUND(H48^0.667,1)),0)","v":0}," m2",{"$f":"IF(H18=0,\"\",IF(0.0004*H70/H18>1,\"Limited to entire Enclosed Area\",\"\"))","v":""}]
[null,null,null,"Distance to LC50 Concentration - Daytime Conditions",null,null,null,0,"m",null,null,null,{"$f":"\"Number of Building Occupants Severely Impacted = Vulnerability times Total Building Occupants = \"","v":"Number of Building Occupants Severely Impacted = Vulnerability times Total Building Occupants = "},null,null,null,null,null,null,null,null,null,null,null,null,null,"Indoor Population Density = Max. Personnel within Enclosed Area / VBldg2/3"]
[null,null,null,"Distance to LC50 Concentration - Nighttime Conditions",null,null,null,0,"m",null,null,null,null,null,null,null,null,null,null,null,null,null,null,null,{"$f":"\"N = ( \"&H49&\" - \"&H8&\" ) / ( \"&H48&\" )^2/3 = \"","v":"N = ( 2 - 1 ) / ( 0 )^2/3 = "},{"$f":"IF(Z62>0,IF(H49>H8,ROUND((H49-H8)/H48^0.667,4),0),0)","v":0}," people/m2"]
[null,null,null,"Distance to LC1 Concentration - Daytime Conditions",null,null,null,0,"m",null,null,null,null,null,null,{"$f":"\"N = \"&S62&\" ( \"&F43&\" ) = \"","v":"N = 0 (  ) = "},{"$f":"ROUND(S62*F43,3)","v":0},null,null,null,null,null,"Toxic Release Personnel Seriously Impacted, N = Impact Area times Population Density plus Personnel in Immediate Area"]
[null,null,null,"Distance to LC1 Concentration - Nighttime Conditions",null,null,null,0,"m",null,null,null,null,null,null,null,null,"Total Personnel Severely Impacted = Direct Blast + Occupants Impacted = ",{"$f":"R58+Q65","v":0}]
[null,null,null,"Distance to Severe Blast Impact ",null,null,null,0,"m",null,null,null,null,null,null,null,null,null,null,null,null,null,null,null,null,{"$f":" \"N = ( \"&Z62&\" sq m ) \"&Z64&\" people/sq m + \"&H8&\" = \"","v":"N = ( 0 sq m ) 0 people/sq m + 1 = "},{"$f":"IF(AND(E5=\"Indoor\",E6=\"Onsite Toxic Release\",Z62>0),IF(Z62*Z64+H8<H49,ROUND(Z62*Z64+H8,2),H49),0)","v":0}]
[null,null,null,"Maximum Fragment Range ",null,null,null,0,"m"]
[null,null,null,"Number of Fragments (typically 3 to 10) ",null,null,null,{"$f":"E69","v":0},null,null,null,"OFFSITE EXPLOSION IMPACT"]
[null,null,null,"Concentration within Enclosed Process Area ",null,null,null,{"$f":"IF(F70=\"Vol %\",E70*10000,E70)","v":0},"ppm",null,null,null,null,null,null,null,null,null,null,null,null,"BLEVE or FIREBALL IMPACT (Outdoor Release Only)"]
[]
[null,null,null,null,null,null,null,null,null,null,null,"Estimated number of people impact within distributed occupied buildings beyond the distance to fence line or public based on building location relative the explosion epicenter"]
[null,"Copyright © 2026",null,null,null,null,null,null,null,null,null,null,null,null,null,null,null,null,null,null,null,"Flammable Mass in the Fireball assumed the Total Airborne Quantity"]
[null,"American Institute of Chemical Engineers",null,null,null,null,null,null,null,null,null,null,null,null,"Coefficient a = ",{"$f":"-4.5*(IF(E40=\"Structural Frame\",1.4,IF(E40=\"Low Strength\",0.5,1)))^2","v":-4.5},null,null,null,null,null,null,null,null,{"$f":"IF(AND(E5<>\"Indoor\",E6=\"BLEVE or Fireball\"),H30,0)","v":0}," Kg",{"$f":"IF(0.012*H18*0.03*H62^3>H30,\"\",\"Limited to Total Airborne Quantity\")","v":"Limited to Total Airborne Quantity"}]
[null,null,null,null,null,null,null,null,null,null,null,"          People Impacted (Equation 15-13) = p f PD ( X1 psi2 ) [ 0 - exp(a X2/ X1 psi2)] / a",null,null,null,null,null,null,null,null,null,{"$f":"IF(Y74<1,\"Less than 1 Kg Flammable Mass in the Fireball does not Indicate Potential for Severe Impact.\",\"\")","v":"Less than 1 Kg Flammable Mass in the Fireball does not Indicate Potential for Severe Impact."}]
[null,null,null,null,null,null,null,null,null,null,null,null,null,null,null,null,null,{"$f":"\"N = 3.14 (\"&H41&\") \"&H38&\" (\"&H60&\")^2 { 0 - exp[\"&P74&\" (\"&H35&\")^2 / (\"&H60&\")^2 ] } / \"&P74&\" = \"","v":"N = 3.14 (0.5) 0.0015 (0)^2 { 0 - exp[-4.5 (0)^2 / (0)^2 ] } / -4.5 = "},{"$f":"IF(E6=\"Offsite Explosion\",ROUND(3.14*H41*H38*H60^2*(0-EXP(P74*H35^2/H60^2))/P74,2),0)","v":0},null,null,null,null,null,null,null,"Fireball Duration, t = 0.45 M1/3 for M < 30000 kg or 2.6 M1/6 for M > 30000 kg = ",{"$f":"IF(Y74>30000,2.6*Y74^(1/6),0.45*Y74^(1/3))","v":0}," sec"]
[]
[null,null,null,null,null,null,null,null,null,null,null,null,null,null,null,null,null,null,null,null,null,null,null,null,null,null,null,"Thermal Radiation Impact Distance (Equation 15-5), Xexpl = 2.64 t0.379 M0.307"]
[null,null,null,null,null,null,null,null,null,null,null,"CHEMICAL EXPOSURE IMPACT",null,null,null,null,null,null,null,null,null,null,null,null,{"$f":"\" = 2.64 ( \"&ROUND(AB76,1)&\" )^0.379 ( \"&ROUND(AB76,1)&\" )^0.307 =\"","v":" = 2.64 ( 0 )^0.379 ( 0 )^0.307 ="},{"$f":"IF(Y74>=1,ROUND(2.64*AB76^0.379*Y74^0.307,1),0)","v":0}," m"]
[null,null,null,null,null,null,null,null,null,null,null,null,null,null,null,null,null,null,null,null,null,null,null,null,"Thermal Radiation Impact Area  = p Xexpl2",null,{"$f":"\" = 3.14 ( \"&Z79&\" )^2 =\"","v":" = 3.14 ( 0 )^2 ="},{"$f":"ROUND(3.14*Z79^2,1)","v":0}," m2"]
[null,null,null,null,null,null,null,null,null,null,null,{"$f":"IF(OR(H26=\"Very Toxic\",H26=\"Toxic\",H26=\"Corrosive\",F27=\"Yes\"),\"Potential contact with Hazardous Material.  Consider Body Area Exposed and Temperature-Toxicity Interactions to Confirm Severity of Impact.\",\"Does Not Meet Criteria for Severe Dermal Impact although Injury May Occur.\")","v":"Does Not Meet Criteria for Severe Dermal Impact although Injury May Occur."},null,null,null,null,null,null,null,null,null,null,"BLEVE or Fireball Personnel Seriously Impacted, N = ( Impact Area times Population Density plus Personnel in Immediate Area ) times Fraction Personnel in Direct radiation path"]
[]
[null,null,null,null,null,null,null,null,null,null,null,null,null,null,null,null,"Spray Impact Area, = 0.4 XSpray2  (assuming 45 deg spray angle)",{"$f":"IF(H18=0,\"\",IF(AND(E5=\"Indoor\",0.0004*H70/H18>1),\"Limited to entire Enclosed Area\",\"\"))","v":""}]
[null,null,null,null,null,null,null,null,null,null,null,null,null,null,{"$f":"\" = 0.4 ( \"&ROUND(H61,1)&\" )^2 =\"","v":" = 0.4 ( 0 )^2 ="},{"$f":"IF(AND(OR(H26=\"Very Toxic\",H26=\"Toxic\",H26=\"Corrosive\",F27=\"Yes\"),E6=\"Chemical Exposure\"),0.4*H61^2,0)","v":0}," m2",null,null,null,null,null,null,null,null,null,{"$f":" \"N = [ ( \"&AB80&\" sq m ) \"&ROUND(H45,1)&\" people/sq m + \"&ROUND(H8,1)&\" ] 0.5 = \"","v":"N = [ ( 0 sq m ) 0 people/sq m + 1 ] 0.5 = "},{"$f":"IF(AND(E5<>\"Indoor\",E6=\"BLEVE or Fireball\"),IF(AB80=0,0,(AB80*H45+H8)*0.5),0)","v":0}]
[null,null,null,null,null,null,null,null,null,null,null,null,"Personnel Seriously Impacted by Spray, N = Impact Area times Population Density plus Personnel in Immediate Area",null,null,null,null,null,null,null,null,null,null,null,null,"Assuming 50% of population seek shelter or are not in the direct radiation path"]
[]
[null,null,null,null,null,null,null,null,null,null,null,null,null,null,null,null,{"$f":" \"N = ( \"&ROUND(P84,1)&\" sq m ) \"&IF(E5=\"Indoor\",IF(H48>0,(H49-H8)/(H48^2/3),0),H45)&\" people/sq m + \"&H8&\" = \"","v":"N = ( 0 sq m ) 0.0002 people/sq m + 1 = "},{"$f":"IF(AND(E6=\"Chemical Exposure\",P84>0),P84*IF(E5=\"Indoor\",IF(H48>0,(H49-H8)/(H48^2/3),0),H45)+H8,0)","v":0}]
[null,null,null,null,null,null,null,null,null,null,null,null,null,null,null,null,null,null,null,null,null,"POOL FIRE RADIATION"]
[]
[]
[null,null,null,null,null,null,null,null,null,null,null,null,null,null,null,null,null,null,null,null,null,{"$f":"\"Estimated Pool Fire Thermal Radiation Vertical Distance based on containment surface area of \"&ROUND(H51,1)&\" m^2, typical burning rate of 0.05 kg/m^2 s, 42000 kJ/kg heat of combustion for typical hydrocarbon and 0.35 fraction of combustion energy radiated.\"","v":"Estimated Pool Fire Thermal Radiation Vertical Distance based on containment surface area of 0 m^2, typical burning rate of 0.05 kg/m^2 s, 42000 kJ/kg heat of combustion for typical hydrocarbon and 0.35 fraction of combustion energy radiated."}]
[]
[]
[null,null,null,null,null,null,null,null,null,null,null,null,null,null,null,null,null,null,null,null,null,null,null,null,"XThermal = [ 58.5 A / Er – 2.67 A0.695 ]1/2"]
[null,null,null,null,null,null,null,null,null,null,null,null,null,null,null,null,null,null,null,null,null,"Thermal Radiation Level, Er",null,null,"(Equation 15-10)",null,null,"Consider exposure duration at specific radiation to determine human harm impact"]
[null,null,null,null,null,null,null,null,null,null,null,null,null,null,null,null,null,null,null,null,null,null,4," kw/m2",null,{"$f":"IF(OR(W96=\"\",H$51=0),\"\",(58.5*H$51/W96-2.67*H$51^0.695)^0.5)","v":""}," m"]
[null,null,null,null,null,null,null,null,null,null,null,null,null,null,null,null,null,null,null,null,null,null,12.5," kw/m2",null,{"$f":"IF(OR(W97=\"\",H$51=0),\"\",(58.5*H$51/W97-2.67*H$51^0.695)^0.5)","v":""}," m"]
[null,null,null,null,null,null,null,null,null,null,null,null,null,null,null,null,null,null,null,null,null,null,37.5," kw/m2",null,{"$f":"IF(OR(W98=\"\",H$51=0),\"\",(58.5*H$51/W98-2.67*H$51^0.695)^0.5)","v":""}," m"]

{"sheet":"Frequency Evaluation","index":8,"n_rows":86,"n_cols":21,"rows_kept":86,"cut":false,"hidden":false,"merged":[[38,7,40,7],[31,3,33,3],[31,5,33,5],[11,1,13,6],[24,4,26,4],[78,1,78,2],[38,2,40,2],[38,4,40,4],[69,14,70,15],[49,2,50,3],[52,14,53,15],[57,14,58,15],[54,14,55,15],[60,14,61,15],[63,14,64,15],[66,14,67,15],[49,4,50,5],[49,6,50,7],[49,8,50,9],[49,10,50,11],[49,12,50,13],[38,16,40,16],[31,10,33,10],[17,8,19,10],[31,15,33,15],[38,14,40,14],[24,9,26,9],[24,14,26,14],[38,9,40,9],[38,12,40,12],[31,8,33,8],[31,13,33,13]]}
[]
[null,null,null,null,null,null,null,null,null,null,null,"PFD for REVEALED and UNREVEALED FAILURES"]
[]
[null,null,null,"Probability of Failure on Demand, PFD, Inputs"]
[null,null,null,"Required Inputs are Shaded \"Yellow\"",null,null,null,null,null,"PFD for Unrevealed Failure (equation 16-4), PFDavg = 1/2 l t"]
[null,null,null,"Failure Rate, l",null,"failure/year",null,null,null,null,"PFDavg =",{"$f":"\" 1/2 ( \"&E6&\" ) \"&E7&\" = \"","v":" 1/2 (  )  = "},null,{"$f":"IF(OR(E6=\"\",E7=\"\"),\"\",0.5*E6*E7)","v":""}]
[null,null,null,"Inspection Interval, t",null,"year"]
[null,null,null,"Mean Time to Repair, MTTR",null,"year",null,null,null,"PFD for Revealed Failure (equation 16-5), PFD = 1 - e-l t"]
[null,"Mean Time Between Failures, MTBF = 1 / l = ",null,null,null,{"$f":"IF(E6=\"\",\"\",1/E6)","v":""},"year",null,null,null,"PFD =",{"$f":"\" 1 - exp( -\"&E6&\" * \"&E7&\" )\"","v":" 1 - exp( - *  )"},null,{"$f":"IF(OR(E6=\"\",E7=\"\"),\"\",1-EXP(-E6*E7))","v":""}]
[null,null,null,"(equation 16-3)"]
[null,null,null,null,null,null,null,null,"PFD for Revealed Failure that may be repaired (equation 16-6), PFD = MTTR/ MTBF"]
[null,"Worksheets for Simple Fault Tree and Simple Event Tree are below.\nA listing of common Frequency or Probability of Failure on Demand (PFD) values are shown to the right.",null,null,null,null,null,null,null,null,"PFD =",{"$f":"E8&\" / \"&F9&\" = \"","v":" /  = "},null,{"$f":"IF(OR(F9=\"\",E8=\"\"),\"\",IF(F9>0,ROUND(E8/F9,4),0))","v":""}]
[]
[]
[]
[]
[null,null,null,null,null,null,null,null,null,"Top Event"]
[null,null,"SIMPLE FAULT TREE",null,null,null,null,"Frequency"]
[null,null,"section 16.10",null,null,null,null,{"$f":"D26+I26+N26","v":0}]
[null,null,"Enter Top Event and Intermediate Event Descriptions",null,null,null,null,"per Year"]
[null,null,"Leave IEFs or PFDs blank that to not apply"]
[null,null,"Allows up to three branches or causes",null,null,null,null,null,null,"OR"]
[]
[]
[null,null,null,"Frequency",null,null,null,null,"Frequency",null,null,null,null,"Frequency"]
[null,null,null,{"$f":"IF(E29=\"OR\",C33+F36,IF(F36=\"\",C33,C33*F36))","v":0},null,null,null,null,{"$f":"IF(J29=\"OR\",H33+K36,IF(K36=\"\",H33,H33*K36))","v":0},null,null,null,null,{"$f":"IF(O29=\"OR\",M33+P36,IF(P36=\"\",M33,M33*P36))","v":0}]
[null,null,null,"per Year",null,null,null,null,"per Year",null,null,null,null,"per Year"]
[]
[null,null,null,null,"AND",null,null,null,null,"AND",null,null,null,null,"AND"]
[]
[]
[null,null,"Frequency",null,null,null,null,"Frequency",null,null,null,null,"Frequency"]
[null,null,{"$f":"IF(D36=\"OR\",C43+E43,IF(E43=\"\",C43,C43*E43))","v":0},null,null,null,null,{"$f":"IF(I36=\"OR\",H43+J43,IF(J43=\"\",H43,H43*J43))","v":0},null,null,null,null,{"$f":"IF(N36=\"OR\",M43+O43+Q43,IF(AND(O43=\"\",Q43=\"\"),M43,IF(Q43=\"\",M43*O43,IF(O43=\"\",M43*Q43,M43*O43*Q43))))","v":0}]
[null,null,"per Year",null,null,null,null,"per Year",null,null,null,null,"per Year"]
[]
[null,null,null,"AND",{"$f":"IF(E29=\"OR\",\"IEF =\",\"PFD =\")","v":"PFD ="},null,null,null,"AND",{"$f":"IF(J29=\"OR\",\"IEF =\",\"PFD =\")","v":"PFD ="},null,null,null,"AND",{"$f":"IF(O29=\"OR\",\"IEF =\",\"PFD =\")","v":"PFD ="},null,null,null,null,null,"CCPS Layers of Protection Analysis, Simplified Process Risk Assessment (2001) page 71"]
[null,null,null,null,null,{"$f":"IF(E29=\"OR\",\"per year\",\"\")","v":""},null,null,null,null,{"$f":"IF(J29=\"OR\",\"per year\",\"\")","v":""},null,null,null,null,{"$f":"IF(O29=\"OR\",\"per year\",\"\")","v":""}]
[]
[]
[]
[]
[]
[null,"IEF = ",null,{"$f":"IF(D36=\"OR\",\"IEF =\",\"PFD =\")","v":"PFD ="},null,null,"IEF = ",null,{"$f":"IF(I36=\"OR\",\"IEF =\",\"PFD =\")","v":"PFD ="},null,null,"IEF = ",null,{"$f":"IF(N36=\"OR\",\"IEF =\",\"PFD =\")","v":"PFD ="},null,{"$f":"IF(N36=\"OR\",\"IEF =\",\"PFD =\")","v":"PFD ="}]
[null,null,"per Year",null,{"$f":"IF(D36=\"OR\",\"per year\",\"\")","v":""},null,null,"per Year",null,{"$f":"IF(I36=\"OR\",\"per year\",\"\")","v":""},null,null,"per Year",null,{"$f":"IF(N36=\"OR\",\"per year\",\"\")","v":""},null,{"$f":"IF(N36=\"OR\",\"per year\",\"\")","v":""}]
[]
[]
[]
[]
[null,null,"Initial Event Description",null,"Event Description",null,"Event Description",null,"Event Description",null,"Event Description",null,"Event Description"]
[]
[]
[null,null,"Frequency per Year",null,"PFD or Probability",null,"PFD or Probability",null,"PFD or Probability",null,"PFD or Probability",null,"PFD or Probability"]
[null,null,null,null,null,null,null,null,null,null,null,null,null,null,"Outcome Description",null,"Frequency"]
[null,null,null,null,null,null,null,null,null,null,null,null,{"$f":"\"Yes (\"&N52&\")\"","v":"Yes ()"}]
[null,null,"SIMPLE EVENT TREE",null,null,null,null,null,null,null,null,null,null,null,null,null,{"$f":"D52*F52*H52*J52*L52*N52","v":0}]
[null,null,"section 16.11",null,null,null,null,null,null,null,{"$f":"\"Yes (\"&L52&\")\"","v":"Yes ()"},null,null,null,null,null,"per Year"]
[null,null,"Enter Event and Outcome Descriptions (such as Protective Layers or Conditions)"]
[null,null,"Enter IEF and Leave PFDs blank that to not apply",null,null,null,null,null,{"$f":"\"Yes (\"&J52&\")\"","v":"Yes ()"},null,null,null,null,null,null,null,{"$f":"D52*F52*H52*J52*L52*(1-N52)","v":0}]
[null,null,"Allows up to 6 Outcome",null,null,null,null,null,null,null,null,null,null,null,null,null,"per Year"]
[null,null,null,null,null,null,null,null,null,null,null,null,{"$f":"\"No (\"&1-N52&\")\"","v":"No (1)"}]
[null,null,null,null,null,null,{"$f":"\"Yes (\"&H52&\")\"","v":"Yes ()"},null,null,null,null,null,null,null,null,null,{"$f":"D52*F52*H52*J52*(1-L52)","v":0}]
[null,null,null,null,null,null,null,null,null,null,null,null,null,null,null,null,"per Year"]
[null,null,null,null,null,null,null,null,null,null,{"$f":"\"No (\"&1-L52&\")\"","v":"No (1)"}]
[null,null,null,null,{"$f":"\"Yes (\"&F52&\")\"","v":"Yes ()"},null,null,null,null,null,null,null,null,null,null,null,{"$f":"D52*F52*H52*(1-J52)","v":0}]
[null,null,null,null,null,null,null,null,null,null,null,null,null,null,null,null,"per Year"]
[null,null,null,null,null,null,null,null,{"$f":"\"No (\"&1-J52&\")\"","v":"No (1)"}]
[null,null,"Initial Event",null,null,null,null,null,null,null,null,null,null,null,null,null,{"$f":"D52*F52*(1-H52)","v":0}]
[null,null,null,null,null,null,null,null,null,null,null,null,null,null,null,null,"per Year",null,null,null,"CCPS Layers of Protection Analysis, Simplified Process Risk Assessment (2001) page 92 and 96."]
[null,null,{"$f":"D52&\" per Year\"","v":" per Year"},null,null,null,{"$f":"\"No (\"&1-H52&\")\"","v":"No (1)"}]
[null,null,null,null,null,null,null,null,null,null,null,null,null,null,null,null,{"$f":"D52*(1-F52)","v":0}]
[null,null,null,null,null,null,null,null,null,null,null,null,null,null,null,null,"per Year"]
[null,null,null,null,{"$f":"\"No (\"&1-F52&\")\"","v":"No (1)"}]
[null,null,null,null,null,null,null,null,null,null,null,null,null,null,null,"Sum of Frequencies = ",{"$f":"Q55+Q58+Q61+Q64+Q67+Q70","v":0}]
[null,null,null,null,null,null,null,null,null,null,null,null,null,null,null,null,"per Year"]
[]
[]
[]
[]
[null,"Copyright © 2026"]
[null,"American Institute of Chemical Engineers"]
[]
[]
[]
[]
[]
[null,null,null,null,null,null,null,null,null,null,null,null,null,null,null,null,null,null,null,null,"CCPS Guidelines for Layers of Protection Analysis (2001) page 103"]

{"sheet":"LOPA Form","index":9,"n_rows":40,"n_cols":5,"rows_kept":40,"cut":false,"hidden":false,"merged":[[38,1,38,2],[1,1,1,4],[31,2,31,4],[32,2,32,4],[33,2,33,4],[34,2,34,4],[5,2,6,2],[5,3,6,3],[5,4,6,4],[30,1,30,2],[29,1,29,2],[3,3,3,4],[4,3,4,4],[11,1,11,2],[17,1,17,2],[28,1,28,2],[16,1,16,2]]}
[]
[null,"Example LOPA Documentation Form per Layers of Protection Analysis - Section 18"]
[null,null,"Inputs are shaded \"yellow\""]
[null,"Scenario Number:","Equipment Identification:","Scenario Title:"]
[]
[null,"Date:","Description","Probability","Frequency\n(per year)"]
[]
[null,"Consequence Description/ Category"]
[null,"Risk Tolerance Criteria (Category or Frequency)"]
[null,"Initiating Event\n(typically a frequency)"]
[null,"Enabling Condition or Event"]
[null,"Conditional Modifiers (if applicable)"]
[null,null,"Probability of Ignition"]
[null,null,"Probability of Personnel in Affected Area"]
[null,null,"Probability of Fatal Injury"]
[null,null,"Others"]
[null,"Frequency of Unmitigated Consequence",null,null,{"$f":"E10*IF(D11=\"\",1,D11)*IF(D13=\"\",1,D13)*IF(D14=\"\",1,D14)*IF(D15=\"\",1,D15)*IF(D16=\"\",1,D16)","v":0}]
[null,"Independent Protection Layers (IPLs)"]
[null,"BPCS"]
[null,"Human Intervention"]
[null,"SIF"]
[null,"Pressure Relief Device"]
[null,"Other Protection Layers (must justify)"]
[null,"Safeguards (Non-IPLs)"]
[]
[]
[]
[]
[null,"Total PFD for all IPLs",null,{"$f":"IF(D19=\"\",1,D19)*IF(D20=\"\",1,D20)*IF(D21=\"\",1,D21)*IF(D22=\"\",1,D22)*IF(D23=\"\",1,D23)","v":1}]
[null,"Frequency of Mitigated Consequence",null,null,{"$f":"D29*E17","v":0}]
[null,"Risk Tolerance Criteria Met? (yes/no)"]
[null,"Actions Required to Meet Risk Tolerance Criteria"]
[null,"Notes"]
[null,"References  (link to originating hazard review, PFD, P&ID, etc.)"]
[null,"LOPA Analysis (and Team Members)"]
[]
[null,"This form is from CCPS, Layers of Protection Analysis  Simplified Process Risk Assessment (2001) page 50."]
[]
[null,"Copyright © 2026"]
[null,"American Institute of Chemical Engineers"]

{"sheet":"References","index":10,"n_rows":14,"n_cols":2,"rows_kept":14,"cut":false,"hidden":false,"merged":[[15,1,24,1]]}
[]
[null,"References:"]
[]
[null,"Guidelines for Chemical Process Quantitative Risk Analysis, 2nd Edition, Center for Chemical Process Safety, American Institute of Chemical Engineers, New York (2000) "]
[null,"Guidelines for Consequence Analysis of Chemical Releases, Center for Chemical Process Safety, American Institute of Chemical Engineers, New York (1999)"]
[null,"Layer of Protection Analysis - Simplified Process Risk Assessment, Center for Chemical Process Safety, American Institute of Chemical Engineers, New York (2001)"]
[null,"Guidelines for Evaluating the Characteristics of Vapor Cloud Explosions, Flash Fires, and BLEVEs, 2nd Edition, Center for Chemical Process Safety, American Institute of Chemical Engineers, New York (2010)"]
[null,"Crowl and Louvar, Chemical Process Safety Fundamentals with Applications, 3rd Edition, Prentice Hall, (2011)"]
[null,"Mannan, Lee’s Loss Prevention in the Process Industries, 3rd Edition, Elsevier, (2005)"]
[null,"Green and Perry, Perry’s Chemical Engineers’ Handbook, 8th Edition, McGraw-Hill, New York (2008)"]
[null,"First, Kenneth. \"Scenario identification and evaluation for layers of protection analysis.\" Journal of Loss "]
[null,"Prevention in the Process Industries November 2010: 705-718. Print."]
[]
[null,"Chemical Hazard Engineering Fundamentals (CHEF) Guide version 4.5, Center for Chemical Process Safety (2025)"]

{"sheet":"Chemical Table","index":11,"n_rows":224,"n_cols":33,"rows_kept":224,"cut":false,"hidden":true,"merged":[]}
["Chemical","CAS Number","Mol\nWt","ERPG1\n(ppm)","ERPG2\n(ppm)","ERPG3\n(ppm)","Boiling\nPoint\n(C)","Melting\nPoint\n(C)","Flash\nPoint\n(C)","LFL\n(vol %)","UFL (vol %)","Autoignition Temp\n(C)","NH","NF","NS","Minimum Ignition Energy","Easily Ignited","Flame Speed","Flame Speed Class","Dermal Tox Risk Statement","Aquatic Tox Risk Statement","Liquid Conductivity","Liquid Conductivity Category","Liq Density\n(g/cc)\nA Coeff","Liq Density\n(g/cc)\nB Coeff","Liq Cp\n(cal/g-C)\nA Coeff","Liq Cp\n(cal/g-C)\nB Coeff","DHv\n(cal/g)\nA Coeff","DHv\n(cal/g)\nB Coeff","DHv\n(cal/g)\nC Coeff","Vapor Press\n(atm)\nA Coeff","Vapor Press\n(atm)\nB Coeff","Vapor Press\n(atm)\nC Coeff"]
["Acetaldehyde","75-07-0",44.05,10,200,1000,20.3,-123,-37.799999999999997,4,null,null,2,4,2,null,"Normal",null,"Medium",null,null,null,"Conductive",0.79500000000000004,1.364E-3,0.5,7.7300000000000003E-4,145.19999999999999,0.26850000000000002,3.5500000000000001E-4,9.9343000000000004,2608.4,30.8]
["Acetic Acid","64-19-7",60.1,5,35,250,117.9,16.5,40,5.4,null,null,3,3,0,null,"Normal",null,"Medium","Corrosive",null,null,"Conductive",1.073,1.2310000000000001E-3,0.46400000000000002,1.062E-3,96,1.2999999999999999E-2,2.61E-4,10.7691,3764.2,41.38]
["Acetic Anhydride","108-24-7",102.1,0.5,15,100,138.6,-73,54,2.7,null,null,3,2,1,null,"Normal",null,"Medium","Corrosive",null,null,"Conductive",1.1040000000000001,1.2999999999999999E-3,0.34499999999999997,8.1599999999999999E-4,117.8,0.40100000000000002,0,13.311,5481.3,0]
["Acetone","67-64-1",58.1,200,3200,5200,56.1,-94.6,-17.8,2.6,null,null,1,3,0,null,"Normal",null,"Medium",null,null,null,"Conductive",0.80800000000000005,1.1800000000000001E-3,0.51200000000000001,5.9000000000000003E-4,134.19999999999999,0.23380000000000001,2.33E-4,9.8424999999999994,2831.55,41.51]
["Acetone Cyanohydrin","75-86-5",85.1,2,7.1,15,162,-19.2,74,2.2000000000000002,null,null,3,2,0,null,null,null,null,null,null,null,null,0.95299999999999996,1.217E-3,0.52,1.6333000000000001E-3,191.9,0.18055599999999999,6.9399999999999996E-4,13.7342,5300.84,51.05]
["Acetonitrile","75-05-8",41.05,13,320,670,81.7,-43.9,2,3,16,525,2,3,0,null,"Normal",null,"Medium","Harmful",null,null,"Conductive",0.80300000000000005,1.0859999999999999E-3,0.53700000000000003,7.1100000000000004E-4,199.7,0.24629999999999999,5.31E-4,9.8954000000000004,3127.43,37.94]
["Acetylene","74-86-2",26.04,65000,230000,400000,-84.9,-80.8,-150,2.5,null,null,0,4,3,null,"Elevated",null,"High",null,null,null,null,0.45700000000000002,1.8499999999999996E-3,0.83199999999999996,1.9374999999999989E-3,96.9,0.58125000000000004,0,10.46156769560316,1965.4996400879418,0]
["Acrolein","107-02-8",56.1,0.05,0.15,1.5,52.5,-87.7,-26,2.8,31,235,4,3,3,null,"Normal",null,"Medium","Toxic","Very Toxic",null,"Conductive",0.85499999999999998,1.201E-3,0.45300000000000001,1.1509999999999999E-3,133.9,0.17249999999999999,5.9699999999999998E-4,9.8120999999999992,2824.64,37.53]
["Acrylamide","79-06-1",71.08,3.4,37.799999999999997,37.799999999999997,230.2,84.5,null,null,null,null,3,0,1,null,"Normal",null,"Medium","Corrosive",null,null,null,0.997,6.6E-4,0.443,9.5E-4,243.7,0.16700000000000001,2.2000000000000001E-4,13.138400000000001,6003.78,45.23]
["Acrylic Acid","79-10-7",72.099999999999994,1,50,250,141.30000000000001,13.9,49.9,5.3,null,null,3,2,2,null,"Normal",null,"Medium","Corrosive","Very Toxic",null,null,1.075,1.24E-3,0.42899999999999999,1.0150000000000001E-3,120,0.2,0,10.9902,3888.69,60.72]
["Acrylonitrile","107-13-1",53.1,10,35,75,77.2,-83.5,-5,3,17,481,4,3,2,null,"Normal",null,"Medium","Toxic","Toxic",null,"Conductive",0.82699999999999996,1.204E-3,0.48399999999999999,5.0900000000000001E-4,157.1,0.20599999999999999,2.7999999999999998E-4,9.7858000000000001,3033.48,40.4]
["Allyl Alcohol","107-18-6",58.1,0.9,13,40,96.9,-129,21,2.5,null,null,4,3,1,null,"Normal",null,"Medium","Toxic","Very Toxic",null,"Conductive",0.872,1.0629999999999999E-3,0.57899999999999996,1.263E-3,198.9,0.26500000000000001,5.9400000000000002E-4,11.4765,3583.24,58.2]
["Allyl Chloride","107-05-1",76.53,3,40,300,45,-134.5,-32,1,null,null,3,3,1,null,null,null,null,"Harmful","Very Toxic",null,null,0.96,1.4E-3,0.35699999999999998,5.9999999999999995E-4,95.2,0.14779999999999999,2.9E-4,9.7954000000000008,2751.49,37.229999999999997]
["Allylamine","107-11-9",57.1,0.42,3.3,18,58,-93,-29,2.2000000000000002,null,null,3,3,0,null,"Normal",null,"Medium","Toxic","Toxic",null,null,0.77800000000000002,1.116E-3,0.56699999999999995,1.088E-3,143.6,0.22900000000000001,4.2700000000000002E-4,9.6469000000000005,2652.64,56.37]
["Ammonia","7664-41-7",17.03,25,150,1500,-33.4,-77.7,-65,15,28,650,3,2,0,null,"Low",null,"Low",null,"Very Toxic",null,"Conductive",0.63500000000000001,1.348E-3,1.1719999999999999,7.8299999999999995E-4,300.5,0.87139999999999995,1.681E-3,10.1227,2021.47,39.450000000000003]
["Amyl Acetate","628-63-7",130.19,100,100,4000,149.30000000000001,-71,25,1,null,null,2,2,0,null,null,null,null,null,null,null,"Semi-Conductive",0.89300000000000002,1.0460000000000001E-3,0.439,9.4169999999999996E-4,92.7,0.11861099999999999,1.8100000000000001E-4,10.5116,3932.03,49.59]
["Amyl Alcohol","71-41-0",88.15,20,20,43,137.80000000000001,-77.599999999999994,46.85,1.2,null,null,2,2,0,null,null,null,null,null,null,null,"Conductive",0.83,8.9999999999999998E-4,0.54300000000000004,2.2417000000000001E-3,163.30000000000001,0.279306,3.0899999999999998E-4,9.8970000000000002,3090.33,97.11]
["Benzene","71-43-2",78.099999999999994,50,150,1000,80.099999999999994,5.5,-11,1.2,null,null,2,3,0,null,"Normal",null,"Medium",null,null,null,"Non-Conductive",0.90400000000000003,1.2210000000000001E-3,0.39,9.5799999999999998E-4,106.6,0.1285,3.2499999999999999E-4,9.3813999999999993,2853.09,49.21]
["Benzocyclobutane","694-87-1",104.2,2,15,85,151.1,null,35,0.8,16.600000000000001,243,0,3,0,null,"Normal",null,"Medium",null,null,null,null,0.95599999999999996,9.4799999999999995E-4,0.34100000000000003,9.2500000000000004E-4,104.6,9.5780000000000004E-2,1.6699999999999999E-4,9.7827000000000002,3657.38,50.49]
["Benzoyl chloride","98-88-4",140.6,0.3,5,20,197.2,-0.2,72,1.2,4.9000000000000004,null,3,2,2,null,"Normal",null,"Medium",null,null,null,null,1.234,1.09E-3,0.23899999999999999,7.2000000000000005E-4,89.5,5.5E-2,1.4999999999999999E-4,10.4353,4414.26,47.37]
["Biphenyl","92-52-4",154.19999999999999,0.05,5,10.5,255.3,68.900000000000006,113,0.6,null,null,2,0,0,null,"Normal",null,"Medium",null,"Very Toxic",null,"Semi-Conductive",1.0580000000000001,8.8999999999999995E-4,0.314,8.9899999999999995E-4,100,7.2499999999999995E-2,1.0399999999999999E-4,9.8712,4443.71,78.510000000000005]
["Bromine","7726-95-6",159.80000000000001,0.1,0.5,5,58.7,-7.3,null,null,null,null,3,0,0,null,null,null,null,null,"Very Toxic",null,"Non-Conductive",3.1850000000000001,3.7829999999999999E-3,0.10299999999999999,7.9200000000000001E-5,48.4,5.7500000000000002E-2,1E-4,9.8712,2920.34,36.08]
["Butadiene (1,3)","106-99-0",54.1,10,200,5000,-4.4000000000000004,-108.9,-76.2,2,11.5,420,2,4,2,null,"Elevated",null,"Medium",null,null,null,null,0.63900000000000001,1.1429999999999999E-3,0.53500000000000003,1.072E-3,98.2,0.25340000000000001,4.4499999999999997E-4,9.2388999999999992,2187.11,32]
["Butane","106-97-8",58.1,5500,17000,53000,-0.6,null,-72,1.6,null,null,1,4,0,null,"Normal",null,"Medium",null,null,null,null,0.60199999999999998,1.1000000000000001E-3,0.56699999999999995,1.1800000000000001E-3,93.1,0.23799999999999999,0,10.439,2843.5,0]
["Butanol (n)","71-36-3",74.12,59,790,8000,118,null,36,1.7,null,null,2,3,0,null,"Normal",null,"Medium",null,null,null,"Conductive",0.82599999999999996,7.9000000000000001E-4,0.52900000000000003,2.1099999999999999E-3,175.7,0.223,0,14.784000000000001,5776.3,0]
["Butyl Acetate, n-","123-86-4",116.16,5,200,3000,126,-77.900000000000006,22,1.4,null,null,2,3,0,null,null,null,null,null,null,null,"Semi-Conductive",0.9,1.1299999999999999E-3,0.45300000000000001,6.0820000000000004E-4,94,0.15190899999999999,7.7299999999999995E-5,10.778600000000001,3909.65,38.51]
["Butyl Acetate, sec-","105-46-4",116.16,600,1700,10000,112,-9.9,16,1.7,null,null,2,3,0,null,null,null,null,null,null,null,null,0.89100000000000001,1.189E-3,0.43099999999999999,9.1989999999999997E-4,89.2,0.122712,2.14E-4,9.7509999999999994,3209.31,56.22]
["Butyl Acetate, tert-","540-88-5",116.16,600,1700,10000,96,-58.2,14.1,1.3,null,null,2,3,0,null,null,null,null,null,null,null,null,0.88900000000000001,1.1119999999999999E-3,0.42599999999999999,1.2269E-3,80.5,9.4167000000000001E-2,2.8600000000000001E-4,9.9819999999999993,3242.13,44.47]
["Butyl Acrylate","141-32-2",128.16999999999999,0.05,25,250,146.6,-64.599999999999994,36,1.3,null,null,3,3,2,null,"Normal",null,"Medium","Harmful",null,null,"Semi-Conductive",0.9145778,8.8748000000000104E-4,0.40954906666666668,8.5559333333333357E-4,90.589289333333326,0.13008893333333332,0,12.62637377938513,5314.1999636091068,0]
["Butyl Hydroperoxide (tertiary)","75-91-2",90.12,null,0.74,22,115,4.3,26.666,null,null,null,2,2,3,null,null,null,null,null,null,null,null,0.91200000000000003,1.119E-3,0.54,1.4212000000000001E-3,138.19999999999999,0.20675499999999999,2.34E-4,12.1381,4130.5,48.86]
["Butyl Isocyanate","111-36-4",99.13,0.01,0.05,1,115.3,null,17,null,null,null,3,3,2,null,null,null,null,null,null,null,null,0.90900000000000003,1.088E-3,0.36299999999999999,1.0457999999999999E-3,100.7,0.11666700000000001,2.0799999999999999E-4,9.9336000000000002,3365.02,50.88]
["Butyl Methacrylate, n-","97-88-1",142.19999999999999,0.17,1.7,224,163,-75.400000000000006,48.85,2,null,null,3,2,0,null,null,null,null,null,null,null,null,0.91300000000000003,1.008E-3,0.45800000000000002,9.5200000000000005E-4,86.2,9.3359999999999999E-2,1.63E-4,10.289899999999999,3929.22,54.88]
["Butyraldehyde","123-72-8",72.11,0.3,75,547,74,-99,-22,1.9,null,null,2,3,1,null,null,null,null,null,null,null,null,0.80600000000000005,1.0369999999999999E-3,0.52900000000000003,8.6879999999999998E-4,116.9,0.21431800000000001,2.1599999999999999E-4,9.64,2910.27,45.43]
["Carbon Dioxide","124-38-9",44.01,null,null,null,-87.8,-56.6,null,null,null,null,0,0,0,null,null,null,null,null,null,null,null,0.97399999999999998,4.1250000000000002E-3,0.47299999999999998,0,60.1,0.39500000000000002,1.25E-4,9.8097999999999992,1590.96,21.73]
["Carbon Disulfide","75-15-0",76.14,1,50,500,46.2,-112,-30,1.3,null,null,2,3,0,null,"Elevated",null,"Medium",null,null,null,"Non-Conductive",1.2909999999999999,1.686E-3,0.253,1.864E-4,89.7,0.12239700000000001,2.1499999999999999E-4,9.6643000000000008,2846.65,25.12]
["Carbon Monoxide","630-08-0",28,200,350,500,-191.5,null,-210,12.5,null,null,2,4,0,null,"Normal",null,"Low",null,null,null,null,0.7,0,0.6,0,50,0,0,9.1683287797779123,748.89300367290514,0]
["Carbon Tetrachloride","56-23-5",153.82,20,100,750,76.8,-22.8,null,null,null,null,3,0,0,null,null,null,null,"Toxic","Harmful",null,"Non-Conductive",1.63,2.0929999999999998E-3,0.193,1.695E-4,52.2,6.5100000000000005E-2,1.45E-4,9.2032000000000007,2784.92,47.34]
["Chlorine","7782-50-5",70.91,1,3,20,-34,-101,null,null,null,null,4,0,0,null,null,null,null,null,null,null,"Non-Conductive",1.4610000000000001,3.0660000000000001E-3,0.23599999999999999,3.9599999999999998E-4,64.099999999999994,0.16020000000000001,5.9400000000000002E-4,9.5018999999999991,2046.46,23.81]
["Chloroacetic Acid","79-11-8",94.5,1.5,6.5,15,189,null,null,null,null,null,4,0,1,null,"Normal",null,"Medium","Very Toxic","Very Toxic",null,"Conductive",1.4520999999999999,1.3389999999999999E-3,0.3659,4.5080000000000001E-4,159.88,0.1711,0,15.761699999999999,7206.13,0]
["Chlorobenzene","108-90-7",112.6,10,150,400,132,-45.3,27,1.8,9.6,null,3,3,0,null,"Normal",null,"Medium",null,null,null,null,1.131,1.191E-3,0.29699999999999999,6.2E-4,89.7,9.0499999999999997E-2,1.55E-4,9.6132000000000009,3405.44,51]
["Chlorodifluoro Methane (Freon 22)","75-45-6",86.47,1250,2100,2400,-48,-157.4,null,null,null,null,2,0,0,null,null,null,null,null,null,null,null,1.2669999999999999,3.5699999999999998E-3,0.30099999999999999,6.4000000000000005E-4,48.6,0.20979999999999999,6.96E-4,9.3157999999999994,1825.17,36.46]
["Chloroform","67-66-3",119.38,null,50,5000,61.2,-63.5,null,null,null,null,2,0,1,null,null,null,null,null,null,null,"Semi-Conductive",1.5209999999999999,2.0950000000000001E-3,0.22800000000000001,1.8100000000000001E-4,65.3,0.10451199999999999,1.4100000000000001E-4,9.4808000000000003,2754.26,43.82]
["Chloropicrin","76-06-2",164.38,7.4999999999999997E-2,0.15,1.5,112,-69.5,null,null,null,null,4,0,3,null,null,null,null,null,null,null,null,1.69,1.7099999999999999E-3,0.19500000000000001,4.0000000000000002E-4,58.2,7.0999999999999994E-2,0,11.894,4579.1000000000004,0]
["Chloropropane (n)","540-54-5",78.540000000000006,null,null,null,46.1,-122.8,-20.2,2.6,null,null,null,null,null,null,"Normal",null,"Medium",null,null,null,null,0.91300000000000003,1.325E-3,0.41799999999999998,7.6130000000000002E-4,94.8,0.1875,3.1300000000000002E-4,9.5107999999999997,2640.69,41.63]
["Chlorosulfonic Acid","7790-94-5",116.52,0.42,2.1,6.29,153.85,-80,null,null,null,null,4,0,2,null,null,null,null,null,null,null,null,1.786,1.6069999999999999E-3,0.23200000000000001,4.7140000000000002E-4,100.4,8.6173E-2,1.6799999999999999E-4,9.7822999999999993,3557,64.38]
["Chlorotrifluoroethylene","79-38-9",116.47,20,100,300,-28.2,-158.30000000000001,null,8.4,null,null,3,4,3,null,null,null,null,null,null,null,null,1.3680000000000001,2.9999999999999997E-4,0.26600000000000001,4.6670000000000001E-4,38.5,0.1384,2.4899999999999998E-4,9.2250999999999994,1964.48,31.9]
["Crotonaldehyde, cis-","15798-64-8",70.09,0.2,5,15,88.7,-114.8,8,2.1,null,null,null,null,null,null,null,null,null,null,null,null,null,0.83699999999999997,1.073E-3,0.46,1.421E-3,132.6,0.1981,1.9000000000000001E-4,10.021000000000001,3157.89,46.91]
["Crotonaldehyde, trans-","123-73-9",70.09,0.2,4.4000000000000004,14,102.3,-75,13,2.1,null,null,3,3,0,null,null,null,null,"Toxic","Very Toxic",null,null,0.86699999999999999,1.083E-3,0.46200000000000002,7.9569999999999999E-4,133.4,0.180227,1.5899999999999999E-4,9.9796999999999993,3317.69,43.05]
["Crotonic Acid","3724-65-0",86.1,0.85,9.3699999999999992,56.8,171.9,15.5,78.900000000000006,2.2999999999999998,null,null,3,2,0,null,"Normal",null,"Medium","Corrosive",null,null,null,1.05,1.0709999999999999E-3,0.53700000000000003,5.1449999999999998E-4,166.2,0.14018,2.1699999999999999E-4,11.5913,4462.71,60.08]
["Crotonyl Chloride","625-35-4",104.5,0.15,1.5,10,121,-64,35,3.3,null,null,3,2,0,null,"Normal",null,"Medium","Corrosive",null,null,null,1.105,1.2830000000000001E-3,0.33500000000000002,7.2800000000000002E-4,100.2,0.1172,1.05E-4,10.063499999999999,3430.01,53.54]
["Cumene","98-82-8",120.2,null,300,730,152.4,-96,33.4,0.88,null,null,2,3,1,null,"Normal",null,"Medium",null,"Toxic",null,"Non-Conductive",0.88300000000000001,9.3499999999999996E-4,0.377,1.0024999999999999E-3,92.3,9.3649999999999997E-2,1.5300000000000001E-4,9.4431999999999992,3426.88,62.62]
["Cyanamide","420-04-2",42,1.165,1.1599999999999999,1.92,265,44,141,1.6,null,null,3,1,1,null,"Normal",null,"Medium","Harmful",null,null,null,1.3140000000000001,1.1540000000000001E-3,0.58799999999999997,6.6799999999999997E-4,415.2,0.3458,1.26E-4,12.456,6170.11,42.94]
["Cyanoacetamide","107-91-5",84.1,0.87,8.7200000000000006,52.3,332.1,118,215,null,null,null,2,0,0,null,null,null,null,null,null,null,null,1.496,1.1299999999999999E-3,0.41299999999999998,5.6499999999999996E-4,222.2,0.158,0,13.94,8435.7000000000007,0]
["Cyanopyridine (2-)","100-70-9",104.1,0.3,3,15,231.6,27,89,1,null,null,2,2,0,null,"Normal",null,"Medium",null,null,null,null,1.113,9.8999999999999999E-4,0.36499999999999999,7.85E-4,134.6,9.9599999999999994E-2,1.2999999999999999E-4,10.009499999999999,4399.99,65.08]
["Cyclohexanone","108-94-1",98.1,60,830,5000,155.4,-31,44,1.1000000000000001,null,null,2,2,0,null,"Normal",null,"Medium",null,null,null,"Conductive",0.96599999999999997,9.5500000000000001E-4,0.41399999999999998,1.0349999999999999E-3,114.1,0.16300000000000001,1.4999999999999999E-4,9.5245999999999995,3508.33,60.33]
["Dichloropropane (1,2-) (Propylene Dichloride)","78-87-5",112.99,30,220,2000,96.3,-100,16,3.2,null,null,1,3,0,null,"Normal",null,"Medium",null,null,null,null,1.1879999999999999,1.5399999999999999E-3,0.29699999999999999,5.1500000000000005E-4,79,9.2999999999999999E-2,2.1000000000000001E-4,9.4312000000000005,3006.42,50.69]
["Diethanol amine","111-42-2",105.1,0.7,1.19,30.2,268.5,28,138,1.53,null,null,2,0,1,null,"Normal",null,"Medium",null,null,null,null,1.135,8.03E-4,0.44700000000000001,9.3999999999999997E-4,194.4,0.11,2.4000000000000001E-4,13.124000000000001,6176.66,71.430000000000007]
["Diethyl Benzene (m-)","141-93-5",134.22,10,100,500,181.1,-83.9,56,0.67,6.03,450,2,2,0,null,null,null,null,null,"Toxic",null,null,0.88200000000000001,8.7900000000000001E-4,0.40600000000000003,1.003E-3,94.6,0.10630000000000001,1.3200000000000001E-4,9.8676999999999992,3891.8,60.01]
["Diethyl Ketone","96-22-0",86.13,300,300,310,102,-39.9,13,1.6,null,null,2,3,0,null,null,null,null,null,null,null,"Conductive",0.83199999999999996,1.1069999999999999E-3,0.48099999999999998,9.276E-4,110.7,0.14439399999999999,2.7999999999999998E-4,9.6967999999999996,3112.79,54.22]
["Diethyl Sulfate","64-67-5",154.19,null,0.15,9.6999999999999993,209.5,-25,78,1.6,null,null,3,1,1,null,null,null,null,null,null,null,null,1.2090000000000001,1.1850000000000001E-3,0.33100000000000002,6.1609999999999996E-4,89.3,5.6462999999999999E-2,9.9400000000000004E-5,10.886900000000001,4678.43,52.92]
["Diethylamine","109-89-7",73.14,null,null,null,55.5,-50,-23,1.8,null,null,3,3,0,null,null,null,null,"Toxic",null,null,null,0.71599999999999997,9.8499999999999998E-4,0.56000000000000005,1.1199999999999999E-3,107.6,0.22589999999999999,2.6499999999999999E-4,9.6786999999999992,2751.97,44.95]
["Diethylene Triamine","111-40-0",103.2,1,1,1,206.5,-39,95,2,6.7,358,3,1,0,null,"Normal",null,"Medium","Harmful",null,null,null,0.97599999999999998,1.096E-3,0.53,8.6799999999999996E-4,146.4,0.13075000000000001,2.61E-4,10.493399999999999,4266.79,74.069999999999993]
["Diisobutyl Ketone","108-83-8",142.19999999999999,25,25,2000,168,-46,49,0.8,null,null,2,2,0,null,"Normal",null,"Medium",null,null,null,null,0.82399999999999995,8.9499999999999996E-4,0.34,8.3000000000000001E-4,87.2,7.9500000000000001E-2,1.55E-4,9.8390000000000004,3682.92,67.19]
["Diisobutylcarbinol","108-82-7",144.26,null,null,null,178.6,-65,null,null,null,null,0,2,0,null,null,null,null,null,null,null,null,0.82199999999999995,8.4199999999999998E-4,0.46100000000000002,1.2125E-3,97.2,0.10347199999999999,2.05E-4,8.7491000000000003,2945.67,113.5]
["Di-isobutylene","107-39-1",112.21,225,2500,15000,101.4,-93.5,-6,0.9,null,null,2,3,0,null,null,null,null,null,null,null,null,0.72799999999999998,9.2299999999999999E-4,0.48499999999999999,1.0954999999999999E-3,79.599999999999994,0.116364,1.94E-4,9.1204000000000001,2969.36,49.61]
["Diketene","674-82-8",84.08,1,5,50,127.4,-6.5,46,null,null,null,2,3,2,null,null,null,null,null,null,null,null,1.105,1.212E-3,0.43099999999999999,2.9599999999999998E-4,132.4,0.18751999999999999,1.66E-4,10.0335,3486.1,53.59]
["Dimethyl Acetamide","127-19-5",87.1,12,12,400,166.1,-20,70,1.8,null,null,2,2,1,null,"Normal",null,"Medium","Toxic",null,null,"Conductive",0.95899999999999996,8.9999999999999998E-4,0.47799999999999998,1.4899999999999999E-4,144.5,0.47560000000000002,0,12.887,5614.3,0]
["Dimethyl Disulfide","624-92-0",94.2,0.01,50,250,109.7,-84.7,7,1.1000000000000001,16,null,2,3,0,null,null,null,null,null,"Very Toxic",null,null,1.087,1.24E-3,0.35499999999999998,4.6000000000000001E-4,100.6,0.11799999999999999,2.0000000000000001E-4,9.5005000000000006,3141.51,52.26]
["Dimethyl Formamide","68-12-2",73.099999999999994,2,100,200,151.1,-60.5,57,2,null,null,2,2,0,null,"Normal",null,"Medium","Toxic",null,null,"Conductive",0.96799999999999997,1E-3,0.45300000000000001,9.1600000000000004E-4,168.3,0.53600000000000003,0,12.659000000000001,5380.2,0]
["Dimethyl Sulphate","77-78-1",126.1,2.4E-2,0.12,1.6,189,null,83,2.9,null,null,4,2,1,null,"Normal",null,"Medium",null,null,null,"Conductive",1.35,1.17E-3,0.5,0,93.9,8.3000000000000004E-2,0,12.462,5757.5,0]
["Dimethylamine (anhy)","124-40-3",45.08,0.6,100,350,7,-134,-58,2.8,null,null,3,4,0,null,"Normal",null,"Medium",null,null,null,"Conductive",0.67900000000000005,1.1999999999999999E-3,0.69499999999999995,6.2299999999999996E-4,142.80000000000001,0.40699999999999997,0,11.571999999999999,3239.1,0]
["Dimethylsulfoxide (DMSO)","67-68-5",78.099999999999994,250,250,900,191,18.5,95,2.6,42,215,1,2,0,null,"Normal",null,"Medium",null,null,null,null,1.1220000000000001,1.0399999999999999E-3,0.40899999999999997,6.5499999999999998E-4,165.4,0.13700000000000001,1.4999999999999999E-4,10.474399999999999,4280.78,55.52]
["Dioctylphthalate","117-84-0",390.6,0.44,4.63,582,384,-50,216,0.3,2.9,391,0,1,0,null,"Normal",null,"Medium",null,null,null,null,1.0069999999999999,9.3400000000000004E-4,0.28299999999999997,7.6400000000000003E-4,73.3,5.8950000000000002E-2,6.3499999999999999E-5,11.3947,6005.9,129.88999999999999]
["Diphenyl Methane","101-81-5",168.24,1,10.8,65.400000000000006,264.7,25.2,130,0.8,null,485,1,1,0,null,null,null,null,null,null,null,null,1.02,7.7700000000000002E-4,0.32900000000000001,7.9900000000000001E-4,93.3,5.3780000000000001E-2,1.07E-4,10.276,4834.2,67.87]
["Diphenyl Oxide","101-84-8",170.21,0.01,5,100,258.10000000000002,26.9,112,0.7,6,620,1,1,0,null,"Normal",null,"Medium",null,"Toxic",null,"Conductive",1.099,9.6299999999999999E-4,0.36499999999999999,6.0700000000000001E-4,94.7,9.2399999999999996E-2,4.07E-5,9.8125,4407.87,82.31]
["Dipropylene Glycol","25265-71-8",134.19999999999999,36.4,72.900000000000006,72.900000000000006,232.2,-40,118,1.4,null,null,1,1,0,null,"Normal",null,"Medium",null,null,null,null,1.0409999999999999,8.2399999999999997E-4,0.47199999999999998,1.1349999999999999E-3,146.30000000000001,0.13950000000000001,1.95E-4,12.321300000000001,5483.49,60.94]
["Divinyl Benzene","1321-74-0",130.19,28,28,170,199.7,null,69,0.7,null,null,3,2,1,null,"Normal",null,"Medium",null,null,null,null,0.94099999999999995,9.5699999999999995E-4,0.35799999999999998,8.3000000000000001E-4,98,7.9000000000000001E-2,1.2799999999999999E-4,9.9192,4145.55,55.41]
["Dodecyl Mercaptan (n-)","112-55-0",202.4,null,0.5,3,274.7,-9,87,null,null,null,3,1,0,null,"Normal",null,"Medium","Harmful",null,null,null,0.86299999999999999,7.2400000000000003E-4,0.41099999999999998,9.59E-4,85.2,6.5670000000000006E-2,8.7000000000000001E-5,10.4389,4886.62,79.36]
["Dodecyl Mercaptan (t-)","25103-58-6",202.4,0.1,50,300,238.1,-45,87,null,null,null,2,1,0,null,"Normal",null,"Medium",null,"Very Toxic",null,null,0.879,9.4399999999999996E-4,0.42,1.0970000000000001E-3,84.8,7.5300000000000006E-2,1.3300000000000001E-4,11.7691,5644.69,31.7]
["Epichlorohydrin","106-89-8",92.5,5,20,100,116.4,-57.1,31,3.8,null,null,3,3,2,null,"Normal",null,"Medium",null,null,null,null,1.21,1.4350000000000001E-3,0.33300000000000002,6.3500000000000004E-4,111.2,0.11940000000000001,2.32E-4,9.9369999999999994,3289.59,58.56]
["Ethalfluralin","55283-68-6",333.27,7.2999999999999995E-2,0.66,3.3,334,54,151,null,null,null,1,1,2,null,"Normal",null,"Medium",null,null,null,null,1.3260000000000001,1.0759999999999999E-3,0.26800000000000002,5.1199999999999998E-4,55.6,3.1379999999999998E-2,5.63E-5,9.9178999999999995,5125.75,90.65]
["Ethane","74-84-0",30.07,3000,33000,200000,-88.7,-183.2,-130.19999999999999,3,12.5,472,1,4,0,null,"Normal",null,"Medium",null,null,null,null,0.438,1.225E-3,0.67100000000000004,8.3799999999999999E-4,82.9,0.43125000000000002,5.9400000000000002E-4,8.9760000000000009,1498.75,17.5]
["Ethanol","64-17-5",46.07,1800,3300,null,78,-114.5,13,4.3,null,null,2,3,1,null,"Normal",null,"Medium","Harmful",null,null,"Conductive",0.80800000000000005,8.8000000000000003E-4,0.53800000000000003,1.91E-3,228.4,0.315,0,14.471,5083.7,0]
["Ethanolamine","141-43-5",61.08,0.1,6,100,170.5,7.9,85,2.5,null,null,3,1,0,null,"Normal",null,"Medium","Harmful",null,null,"Conductive",1.03,7.5600000000000005E-4,0.625,1.1490000000000001E-3,251.2,0.36399999999999999,0,15.317,6788.3,0]
["Ethyl Acetate","141-78-6",88.11,200,2000,8000,77.099999999999994,-83.6,-4,2,null,null,1,3,0,null,"Normal",null,"Medium",null,null,null,"Conductive",0.91900000000000004,1.276E-3,0.46100000000000002,5.5369999999999996E-4,100.8,0.17990200000000001,1.2899999999999999E-4,9.86,2962.28,50.06]
["Ethyl Acrylate","140-88-5",100.1,0.01,30,300,99.7,-71,10,1.4,null,null,3,3,2,null,"Normal",null,"Medium",null,null,null,null,0.95199999999999996,1.3849999999999999E-3,0.38,8.3000000000000001E-4,93.6,0.1125,3.2499999999999999E-4,9.4903999999999993,2967.02,60.24]
["Ethyl Benzene","100-41-4",106.17,33,1100,1800,136,-95,22.7,0.82,null,null,2,3,0,null,null,null,null,null,null,null,"Non-Conductive",0.88500000000000001,9.7900000000000005E-4,0.377,9.9170000000000009E-4,97.9,0.105278,1.84E-4,9.5045999999999999,3365.51,55.32]
["Ethyl Chloride","75-00-3",64.510000000000005,null,null,null,12.3,-136.4,-50,3.5,null,null,2,4,0,null,null,null,null,null,"Harmful",null,"Conductive",0.91400000000000003,1.3500000000000001E-3,0.379,6.556E-4,94.2,0.19388900000000001,3.2699999999999998E-4,9.5702999999999996,2432.0300000000002,31.43]
["Ethyl Chloroacetate","105-39-5",122.55,null,1.2,7.1,143,-25.9,64,5.2,null,null,3,2,2,null,"Normal",null,"Medium",null,null,null,"Conductive",1.1758,1.248E-3,0.32679999999999998,6.0550000000000003E-4,97.58,0.13516,0,12.853759999999999,5356.19,0]
["Ethyl Chloroformate","541-41-3",108.52,null,5,10,92.9,-81.2,2,3.5,null,null,3,3,1,null,null,null,null,null,null,null,null,1.161,1.621E-3,0.441,6.2310000000000002E-4,115.3,0.201429,2.8600000000000001E-4,13.620100000000001,4436.6000000000004,40.89]
["Ethyl Cyanoacetate","105-56-6",113.1,1,12,61,206,-22.5,110,1.7,null,null,0,1,0,null,null,null,null,null,null,null,"Conductive",1.081,1.0200000000000001E-3,0.42499999999999999,8.6600000000000002E-4,152.5,0.17299999999999999,0,13.234999999999999,6339.7,0]
["Ethyl Ether","60-29-7",74.12,500,500,19000,34.5,-116.3,-45,1.9,null,null,2,4,3,null,null,null,null,null,null,null,null,0.72799999999999998,1.1999999999999999E-3,0.5,1.0250000000000001E-3,92.2,0.18540000000000001,3.5500000000000001E-4,9.3613999999999997,2479.87,42.35]
["Ethyl Hexaldehyde","123-05-7",128.21,300,1500,1500,164,null,44,0.85,null,null,1,2,0,null,null,null,null,null,null,null,null,0.83899999999999997,9.7900000000000005E-4,0.45400000000000001,7.917E-4,92.5,0.13833300000000001,5.5600000000000003E-5,10.583,4210.83,39.380000000000003]
["Ethyl Hexanol (2-)","104-76-7",130.22999999999999,0.1,100,200,184.6,-70,73,0.9,null,null,2,3,0,null,"Normal",null,"Medium","Harmful",null,null,"Semi-Conductive",0.86,9.3899999999999995E-4,0.61799999999999999,9.1699999999999995E-4,142.4,0.25530000000000003,1.74E-4,9.0416000000000007,2962.2,129.94999999999999]
["Ethyl Hexonic Acid","149-57-5",144.21,2.54,8.65,100,227.5,null,114,null,null,null,2,2,0,null,null,null,null,null,null,null,null,0.93600000000000005,9.4799999999999995E-4,0.46800000000000003,1.0667000000000001E-3,133.30000000000001,0.143621,2.14E-4,12.9064,5732.43,58.81]
["Ethyl Hexyl Acrylate","103-11-7",184.28,15,21,150,217.6,-90,82,0.7,null,null,3,2,1,null,null,null,null,null,null,null,"Semi-Conductive",0.90600000000000003,1.0070000000000001E-3,0.38900000000000001,9.7989999999999991E-4,79,7.0722999999999994E-2,1.26E-4,9.9899000000000004,4170.41,73.53]
["Ethyl Toluene","611-14-3",120.19,2.44,26.4,488,165.2,-80.900000000000006,39,1,null,440,0,2,0,null,null,null,null,null,null,null,null,0.89900000000000002,9.1299999999999997E-4,0.39900000000000002,9.5E-4,97.5,9.9299999999999999E-2,1.44E-4,9.5723000000000003,3588.81,63.41]
["Ethyl Vinylether","109-92-2",72.099999999999994,9.4,100,620,35.799999999999997,-115.8,-46.2,1.7,null,null,null,null,null,null,"Normal",null,"Medium",null,null,null,null,0.77400000000000002,1.238E-3,0.47899999999999998,9.7849999999999999E-4,95.9,0.18834999999999999,3.68E-4,9.5815000000000001,2603.08,37.26]
["Ethylene","74-85-1",28.05,600,6600,40000,-103.8,null,-140,2.7,null,null,2,4,2,null,"Elevated",null,"High",null,null,null,null,0.38500000000000001,1.8400000000000001E-3,0.75,2.0999999999999999E-3,65,0.48,0,9.7140000000000004,1643,0]
["Ethylene Diamine","107-15-3",60.1,0.03,15,75,117,10,34,3.9,null,null,3,2,0,null,"Normal",null,"Medium",null,null,null,"Conductive",0.91400000000000003,9.5E-4,0.59699999999999998,8.0000000000000004E-4,185.2,0.23400000000000001,0,13.557,5285.8,0]
["Ethylene Dichloride","107-06-2",98.96,50,200,300,83.5,-35.700000000000003,13.3,4.5,null,null,2,3,0,null,null,null,null,null,null,null,"Semi-Conductive",1.2749999999999999,1.562E-3,0.28899999999999998,4.1790000000000002E-4,87.7,0.111848,2.0799999999999999E-4,9.9141999999999992,3127.68,41.19]
["Ethylene Glycol","107-21-1",62.1,30,150,900,197.4,-13.4,111,3.2,null,null,2,1,1,null,"Normal",null,"Medium",null,null,null,"Conductive",1.129,8.5599999999999999E-4,0.57099999999999995,9.0140000000000001E-4,254.6,0.19,3.57E-4,12.3962,5117.6400000000003,57.58]
["Ethylene Oxide","75-21-8",44.05,null,50,500,10.5,-112.4,-50,3,100,429,3,4,3,null,"Elevated",null,"High",null,null,null,"Conductive",0.89100000000000001,1.3730000000000001E-3,0.48899999999999999,6.7900000000000002E-4,140.9,0.25869999999999999,4.8299999999999998E-4,9.8683999999999994,2468.44,33.47]
["Formaldehyde","50-00-0",30.03,1,10,40,-19.2,-118.3,-30,7,null,null,3,2,2,null,"Normal",null,"Medium","Toxic",null,null,null,0.77,1.8E-3,0.72,6.4000000000000005E-4,182,0.47,0,11.42,2900,0]
["Formic Acid","64-18-6",46.03,3,25,250,100.6,8,59.9,18,null,null,3,2,1,null,"Normal",null,"Medium","Corrosive",null,null,null,1.254,1.555E-3,0.49399999999999999,8.0800000000000002E-4,124,0.09,0,10.2896,3528.27,30.31]
["Glycerine","56-81-5",92.1,7.96,82.3,664,289.60000000000002,17.899999999999999,199,null,null,null,1,1,0,null,null,null,null,null,null,null,null,1.3,8.8400000000000002E-4,0.45800000000000002,7.2179999999999998E-4,231.5,0.128881,2.1900000000000001E-4,10.003299999999999,4144.07,143.4]
["HCFC 142B (Chloro-1,1-Difluoroethane, 1-)","75-68-3",100.5,10000,15000,25000,-9.1999999999999993,-130.80000000000001,-59,7.8,null,null,0,4,0,null,null,null,null,null,null,null,null,1.1579999999999999,2.1879999999999998E-3,0.30599999999999999,4.3130000000000002E-4,54.7,4.1563000000000003E-2,-5.1599999999999997E-4,9.3641000000000005,2167.0700000000002,32.6]
["Heptane","142-82-5",100.2,490,800,4900,98.4,-90.6,-4,1.1000000000000001,null,null,1,3,0,null,"Normal",null,"Medium",null,null,null,"Non-Conductive",0.69599999999999995,9.1799999999999998E-4,0.495,1.2327E-3,90.8,0.1351453,2.2599999999999999E-4,9.5328999999999997,3094.57,47.27]
["Hexachlorobutadiene","87-68-3",260.76,1,3,10,214.2,-18.600000000000001,null,null,null,null,3,0,0,null,null,null,null,null,null,null,null,1.7130000000000001,1.6429999999999999E-3,0.158,2.2499999999999999E-4,52.5,4.5407999999999997E-2,6.8899999999999994E-5,9.7802000000000007,4105.13,68.290000000000006]
["Hexafluoroacetone","684-16-2",166.02,null,1,50,-27.3,-125.5,null,null,null,null,3,0,2,null,null,null,null,null,null,null,null,1.421,3.921E-3,0.38900000000000001,1.3213999999999999E-3,27,3.5000000000000003E-2,-1.5E-3,9.8675999999999995,2133.81,29.94]
["Hexane","110-54-3",86.2,null,2900,8600,68.7,-95.3,-22,1.1000000000000001,null,null,2,3,0,null,"Normal",null,"Medium",null,null,null,"Non-Conductive",0.67400000000000004,1.0250000000000001E-3,0.51200000000000001,1.225E-3,91.6,0.1439,3.5500000000000001E-4,9.3192000000000004,2765.81,45.11]
["Hexanol, 2-","626-93-7",102.18,null,0.91,5.5,139.9,-50.2,41,1.2,null,null,2,2,0,null,null,null,null,null,null,null,null,0.83099999999999996,9.5E-4,0.54400000000000004,1.14E-3,144.80000000000001,0.29013899999999998,2.4699999999999999E-4,13.079499999999999,5042.49,32.369999999999997]
["Hexanol, n-","111-27-3",102.18,1,5.7,34,157.30000000000001,-47.4,63,1.2,null,null,3,2,0,null,"Normal",null,"Medium",null,null,null,null,0.83299999999999996,8.6700000000000004E-4,0.58899999999999997,1.1375000000000001E-3,151.19999999999999,0.239375,2.7099999999999997E-4,9.2789000000000001,2886.34,118.62]
["Hexene, 1-","592-41-6",84.16,null,500,5000,63.5,-139.80000000000001,-26,1.2,null,null,2,3,0,null,"Normal",null,"Medium",null,null,null,null,0.68799999999999994,9.8999999999999999E-4,0.53,1.5642E-3,90.6,0.14316699999999999,2.5399999999999999E-4,9.6570999999999998,2911.18,35.08]
["Hydrazine","302-01-2",32.049999999999997,0.5,5,30,113.5,2,38,4.7,null,null,3,2,1,null,null,null,null,"Toxic",null,null,null,1.028,9.810000000000001E-4,0.72899999999999998,9.4700000000000003E-4,345.1,0.32950000000000002,4.8500000000000003E-4,11.173299999999999,3783.81,48.1]
["Hydrogen Bromide","10035-10-6",80.91,1,25,120,-66.900000000000006,-86.9,null,null,null,null,3,0,1,null,null,null,null,null,null,null,"Conductive",1.889,4.267E-3,0.19700000000000001,-9.3300000000000005E-5,42.7,0.16964399999999999,2.7599999999999999E-4,9.7441999999999993,1878.2,13.49]
["Hydrogen Chloride (anhy)","7647-01-0",36.46,3,20,150,-85,null,null,null,null,null,3,0,1,null,null,null,null,null,null,null,"Conductive",0.93300000000000005,2.8140000000000001E-3,0.47,7.9800000000000002E-5,73.099999999999994,0.46112999999999998,8.6899999999999998E-4,9.7334999999999994,1665.21,16.55]
["Hydrogen Cyanide","74-90-8",27.03,null,10,25,25.7,-13.3,-18,5.6,40,538,4,4,2,null,"Elevated",null,"Medium",null,"Very Toxic",null,"Conductive",0.70799999999999996,1.472E-3,0.75800000000000001,3.1110000000000003E-4,251,0.95555599999999996,5.5560000000000002E-3,11.108599999999999,3278.4,3.61]
["Hydrogen Fluoride","7664-39-3",20.010000000000002,2,20,50,19,-117.7,null,null,null,null,4,0,1,null,null,null,null,"Very Toxic",null,null,null,1.01,2.1199999999999999E-3,0.57999999999999996,3.8800000000000002E-3,80,-0.43,0,10.571999999999999,3092.3,0]
["Hydrogen Peroxide","7722-84-1",34.03,10,50,100,150.19999999999999,-0.4,null,null,null,null,3,0,3,null,null,null,null,null,null,null,null,1.474,1.2650000000000001E-3,0.63400000000000001,1.9799999999999999E-4,375.3,0.31495000000000001,1.45E-4,11.831099999999999,4439.17,49.02]
["Hydrogen Sulfide","7783-06-4",34.08,0.1,30,100,-60.3,-85.6,null,4,null,null,4,4,0,null,"Normal",null,"Medium",null,"Very Toxic",null,"Semi-Conductive",0.81499999999999995,1.753E-3,0.51300000000000001,7.7329999999999999E-4,110.1,0.404889,9.4200000000000002E-4,9.8826000000000001,1940.4,16.399999999999999]
["Isobutane","75-28-5",58.12,800,800,4000,-11.8,-159.4,-81.150000000000006,1.6,null,null,0,4,0,null,null,null,null,null,null,null,null,0.57499999999999996,1.119E-3,0.56799999999999995,1.2063E-3,84,0.25640600000000002,4.2999999999999999E-4,9.1414000000000009,2134.87,27.87]
["Isobutanol","78-83-1",74.12,150,1300,8000,107.9,-108,28,1.7,null,null,1,3,0,null,null,null,null,null,null,null,"Conductive",0.81499999999999995,1.041E-3,0.55600000000000005,2.1364000000000001E-3,169.6,0.209091,1.0330000000000001E-3,12.193899999999999,4050.53,50.93]
["Isobutene","115-11-7",56.1,750,1800,11000,-6.9,-140.4,-76.099999999999994,1.6,null,null,1,4,0,null,"Normal",null,"Medium",null,null,null,null,0.61199999999999999,1.1559999999999999E-3,0.56699999999999995,1.1800000000000001E-3,91.5,0.26773999999999998,4.6999999999999999E-4,9.1601999999999997,2141.6,32.43]
["Isobutyl Acetate","110-19-0",116.16,440,1260,7500,116.8,-98,18,1.3,null,null,1,3,0,null,"Normal",null,"Medium",null,null,null,"Semi-Conductive",0.88900000000000001,1.1299999999999999E-3,0.435,9.9130000000000008E-4,91.3,0.134102,2.1900000000000001E-4,10.2384,3526.94,46.93]
["Isobutylene","115-11-7",56.11,750,2500,11000,-6.9,-140.4,-76.150000000000006,1.6,null,null,1,4,0,null,null,null,null,null,null,null,null,0.61099999999999999,1.147E-3,0.56599999999999995,1.1823999999999999E-3,91.4,0.26817000000000002,4.7800000000000002E-4,9.1011000000000006,2116.42,33.479999999999997]
["Isobutyraldehyde","78-84-2",72.099999999999994,65,65,470,63.9,-65,-18.2,1.6,null,null,2,3,1,null,"Normal",null,"Medium",null,null,null,null,0.82099999999999995,1.126E-3,0.47899999999999998,1.0529999999999999E-3,110.2,0.1578,3.2899999999999997E-4,9.8335000000000008,2927.3,39.4]
["Isobutyronitrile","78-82-0",69.11,null,30,100,103.6,-71.5,8.3330000000000002,1.9,null,null,3,3,0,null,null,null,null,null,null,null,null,0.78700000000000003,1.0549999999999999E-3,0.52300000000000002,1.2273E-3,138.69999999999999,0.175455,3.1799999999999998E-4,9.9023000000000003,3264.6,47.51]
["Isopentane","78-78-4",72.150000000000006,600,610,4400,27.8,-159.9,-56.15,1.4,null,null,1,4,0,null,"Normal",null,"Medium",null,null,null,null,0.63300000000000001,9.6699999999999998E-4,0.52,1.3722000000000001E-3,87.4,0.184444,3.6999999999999999E-4,9.1895000000000007,2446.94,34.79]
["Isophorone","78-59-1",138.21,4,5,800,215.3,-8.1999999999999993,84,0.8,null,null,2,2,1,null,"Normal",null,"Medium","Harmful",null,null,null,0.94099999999999995,8.6200000000000003E-4,0.37,9.345E-4,95.9,8.9511999999999994E-2,7.6100000000000007E-5,10.196999999999999,4592.16,35.69]
["isoPropanol","67-63-0",60.09,400,400,12000,82,-85.8,12,2,null,null,1,3,0,null,"Normal",null,"Medium",null,null,null,"Conductive",0.80100000000000005,8.4999999999999995E-4,0.55200000000000005,2.8600000000000001E-3,188,0.26200000000000001,0,15.348000000000001,5451.6,0]
["Isopropyl Acetate","108-21-4",102.13,200,200,16000,88.6,-73,2,1.8,null,null,1,3,1,null,"Normal",null,"Medium",null,null,null,"Conductive",0.90300000000000002,1.474E-3,0.41099999999999998,9.8729999999999998E-4,93,0.149394,2.7E-4,9.7274999999999991,2990.42,54.58]
["isoPropyl amine (anhy)","75-31-0",59.11,10,670,4000,32,-139.4,-39,2,null,null,3,4,0,null,"Normal",null,"Medium",null,null,null,null,0.71099999999999997,1.08E-3,0.623,1.17E-3,121,0.29699999999999999,0,11.698,3565.4,0]
["Isopropyl Chloroformate","108-23-6",122.55,150,520,1600,103.8,null,20,4,null,null,3,3,3,null,"Normal",null,"Medium",null,null,null,null,1.095,1.382E-3,0.33400000000000002,7.4089999999999996E-4,81.8,0.109793,2.02E-4,10.166,3326.48,49.77]
["Isopropyl Ether","108-20-3",102.18,null,null,null,68.599999999999994,-85.5,-28.15,1.4,null,null,0,3,3,null,"Normal",null,"Medium",null,null,null,null,0.73799999999999999,1.085E-3,0.48799999999999999,8.0500000000000005E-4,78.900000000000006,0.1605,5.0000000000000002E-5,9.5012000000000008,2798.2,46.95]
["Maleic Anhydride","108-31-6",98.1,0.2,2,20,204.1,56,102,1.4,null,null,3,1,1,null,"Normal",null,"Medium","Corrosive",null,null,null,1.395,1.4E-3,0.35,4.4499999999999997E-4,133.6,0.10100000000000001,1.55E-4,10.244,4282.6400000000003,59.41]
["Mesityl Oxide","141-79-7",98.14,25,25,5000,129.69999999999999,-52.9,30.6,1.4,null,null,1,3,3,null,null,null,null,"Harmful",null,null,null,0.875,1.029E-3,0.45600000000000002,9.3329999999999997E-4,110.6,0.1525,2.22E-4,9.8249999999999993,3436.28,53.42]
["Methacrylic Acid","79-41-4",86.1,6.7,61,220,162.5,15.9,67,2,null,null,3,2,2,null,"Normal",null,"Medium","Corrosive",null,null,null,1.05,1.1900000000000001E-3,0.46400000000000002,7.9000000000000001E-4,170.4,0.24099999999999999,0,13.37750089,5844.9605970000002,0]
["Methacrylonitrile","126-98-7",67.09,null,1,3.1,90.3,-36.200000000000003,21,1.7,null,null,4,3,2,null,"Normal",null,"Medium","Toxic",null,null,null,0.81599999999999995,1.145E-3,0.46500000000000002,7.5000000000000002E-4,121.3,0.17272699999999999,2.52E-4,9.8336000000000006,3310.79,26.79]
["Methane","74-82-8",16.04,2900,2900,17000,-161.5,-182.5,-187.2,5,null,null,0,4,0,null,"Normal",null,"Low",null,null,null,null,0.124,1.7600000000000001E-3,1.4339999999999999,3.7499999999999999E-3,44.8,0.41699999999999998,0,9.2859999999999996,1037.0999999999999,0]
["Methanol","67-56-1",32.04,200,1000,5000,65,-97,11,6.7,36,385,1,3,0,null,"Normal",null,"Medium",null,null,null,"Conductive",0.79500000000000004,8.7699999999999996E-4,0.61299999999999999,1.8220000000000001E-3,285.2,0.28129999999999999,1.193E-3,12.0992,3737.63,28.89]
["Methyl Acrylate","96-33-3",86.09,6,170,1000,80.7,-75,-3,2.1,null,null,3,3,2,null,"Normal",null,"Medium","Harmful",null,null,"Conductive",0.97668229411764695,1.4640705882352899E-3,0.37061064705882352,7.216647058823529E-4,97.920070588235291,0.18156294117647054,0,11.301305488051336,4043.2134562167771,0]
["Methyl Amine","74-89-5",31.08,10,100,500,-6.3,-93.5,-62,4.9000000000000004,null,null,3,4,0,null,null,null,null,"Harmful",null,null,null,0.67900000000000005,1.206E-3,0.83299999999999996,-1.2400000000000001E-4,195.4,0.51038099999999997,3.4600000000000001E-4,10.1656,2309.35,39.68]
["Methyl Amyl Alcohol","108-11-2",102.18,0.04,40,200,131.69999999999999,-90,40.85,1,null,null,2,2,0,null,null,null,null,null,null,null,"Conductive",0.82099999999999995,9.5200000000000005E-4,0.54400000000000004,1.3087000000000001E-3,120.9,0.14877099999999999,3.1E-4,11.262700000000001,3975.92,52.79]
["Methyl Butyraldehyde, 2-","96-17-3",86.13,10,93,467,91.7,-60,-2.15,1.24,null,null,2,3,1,null,"Normal",null,"Medium",null,null,null,null,0.82399999999999995,1.041E-3,0.497,6.8880000000000005E-4,104.7,0.111818,2.7500000000000002E-4,10.2057,3336.83,37.96]
["Methyl Chloride","74-87-3",50.49,150,1000,3000,-24.2,-97.7,-45,7,null,null,1,4,0,null,"Normal",null,"Medium",null,null,null,null,0.96699999999999997,3.3E-3,0.39600000000000002,1.7899999999999999E-3,96.6,0.52,0,10.375999999999999,2575.6,0]
["Methyl Chloroformate","79-22-1",97.5,null,2,5,71.2,null,12,null,null,null,3,3,0,null,null,null,null,"Harmful",null,null,null,1.244,1.714E-3,0.318,5.2859999999999995E-4,90.3,0.13326499999999999,2.4899999999999998E-4,9.9372000000000007,2966.51,54.94]
["Methyl Cyanoacetate","105-34-0",99.1,1,12,61,205.1,-13.1,110,2.2999999999999998,null,null,0,1,0,null,"Normal",null,"Medium",null,null,null,"Conductive",1.1459999999999999,1.34E-3,0.41799999999999998,6.2500000000000001E-4,151.5,0.17100000000000001,0,13.260999999999999,6340.3,0]
["Methyl Ethyl Ketone","78-93-3",72.11,100,2700,4000,79.599999999999994,-87.1,-9,1.4,null,null,2,3,0,null,null,null,null,null,null,null,"Conductive",0.82,1.129E-3,0.45700000000000002,1.1257000000000001E-3,118.6,0.14818200000000001,4.0900000000000002E-4,9.9793000000000003,3131.26,39.22]
["Methyl Iodide","74-88-4",141.94,25,50,125,42.4,-66.2,null,null,null,null,3,0,1,null,null,null,null,"Harmful",null,null,null,2.3199999999999998,3.0479999999999999E-3,0.14000000000000001,9.5199999999999997E-5,49.7,7.4081999999999995E-2,1.13E-4,9.4619,2650.56,35.42]
["Methyl Isobutyl Ketone","108-10-1",100.16,75,490,3000,116,-84.7,13.9,1.5,null,null,2,3,0,null,null,null,null,null,null,null,"Conductive",0.80800000000000005,8.1800000000000004E-4,0.46,1.0036000000000001E-3,100.8,0.137879,2.2000000000000001E-4,9.9385999999999992,3411.64,46.83]
["Methyl Isocyanate","624-83-9",57.05,2.5000000000000001E-2,0.25,1.5,38,null,-7,5.3,null,null,4,3,2,null,"Normal",null,"Medium",null,null,null,null,0.97899999999999998,1.2099999999999999E-3,0.38800000000000001,6.3000000000000003E-4,121.8,0.19600000000000001,0,11.243,3501.1,0]
["Methyl Mercaptan","74-93-1",48.1,5.0000000000000001E-3,25,100,5.9,-123,-18,3.9,null,null,4,4,0,null,"Normal",null,"Medium",null,"Very Toxic",null,null,0.88300000000000001,1.3669999999999999E-3,0.44700000000000001,5.71E-4,122.7,0.2465,4.2900000000000002E-4,9.5298999999999996,2326.8200000000002,34.880000000000003]
["Methyl Mercaptopropionaldehyde","3268-49-3",104.17,5.9999999999999995E-4,0.01,0.03,null,170.8,61,null,null,null,3,2,1,null,null,null,null,null,null,null,null,1.0740000000000001,1.126E-3,0.442,4.704E-4,124.6,0.138519,1.4799999999999999E-4,10.499700000000001,4088.21,56.53]
["Methyl Methacrylate","80-62-6",100.11,17,120,570,100.7,-48.2,8.8000000000000007,1.7,8.1999999999999993,435,2,3,2,null,"Normal",null,"Medium",null,null,null,null,0.96199999999999997,1.25E-3,0.38200000000000001,8.1820000000000005E-4,92.7,0.13512399999999999,-6.0300000000000002E-4,9.7637999999999998,3110.78,55.79]
["Methyl Styrene (alpha)","98-83-9",118.18,100,830,5000,165.4,-22.4,48,1.5,6.1,442,2,2,0,null,null,null,null,null,null,null,null,0.93,9.4300000000000004E-4,0.38200000000000001,9.2199999999999997E-4,100.1,0.10059999999999999,1.5100000000000001E-4,9.7795000000000005,3691.42,61.27]
["Methyl Vinyl Acetate","108-22-5",100.12,0.49,4.88,24.42,96.9,-92.9,9.85,1.74,null,null,0,3,0,null,null,null,null,null,null,null,null,0.93400000000000005,1.1299999999999999E-3,0.46700000000000003,5.5509999999999999E-4,97.3,0.16992399999999999,-2.03E-4,10.2355,3294.83,48.47]
["Methyl-2-Pyrrolidone (n)   (NMP)","872-50-4",99.13,1,15,250,204,-24,86,2.2000000000000002,12.2,null,2,2,1,null,"Normal",null,"Medium",null,null,null,"Conductive",1.054,9.6100000000000005E-4,0.33300000000000002,1.1050000000000001E-3,133.30000000000001,8.9349999999999999E-2,1.7200000000000001E-4,10.007400000000001,4131.1400000000003,64.69]
["Methylene Chloride","75-09-02",84.94,300,750,4000,40,-97,null,14.5,21.2,556,2,1,0,null,"Low",null,"Medium",null,null,null,"Semi-Conductive",1.355,2.0300000000000001E-3,0.28799999999999998,2.1450000000000001E-4,85.4,0.1552,2.1900000000000001E-4,9.6221999999999994,2594.38,43.2]
["Monomethyl Amine","74-89-5",31.06,10,100,500,-6.3,-93.5,30,4.9000000000000004,null,null,3,4,0,null,null,null,null,null,null,null,null,0.69,1.5120000000000001E-3,0.871,2.947E-3,197.8,0.50224899999999995,1.3489999999999999E-3,10.462,2441.91,33.46]
["Neodecanoyl chloride","40292-82-8",190.7,0.1,1,4,210.7,-60,92,5.4,9.9,null,3,2,2,null,"Normal",null,"Medium",null,null,null,null,0.97,9.9299999999999996E-4,0.34599999999999997,8.5999999999999998E-4,70.5,5.7200000000000001E-2,8.3999999999999995E-5,10.5229,4551.32,51.21]
["Nitrapyrin","1929-82-4",230.9,2.1,2.1,20.100000000000001,271,null,null,null,null,null,1,0,1,null,null,null,null,null,null,null,null,1.5327999999999999,1.1849999999999994E-3,0.21759999999999999,3.0499999999999999E-4,69.7,6.5000000000000002E-2,0,13.017762087892438,7094.3679472131307,0]
["Nitroethane","79-24-3",75.099999999999994,170,170,1000,114.1,-89.5,28,3.4,null,null,1,3,3,null,"Normal",null,"Medium",null,null,null,"Conductive",1.071,1.3270000000000001E-3,0.41299999999999998,7.8899999999999999E-4,137.5,0.17519999999999999,2.7599999999999999E-4,10.031499999999999,3400.61,48.37]
["Nitrogen","7727-37-9",28,null,null,null,-196,null,null,null,null,null,0,0,0,null,null,null,null,null,null,null,null,5.8000000000000003E-2,3.8500000000000001E-3,0.54700000000000004,5.0000000000000002E-5,9,0.2,0,5.6073000000000004,242.98,33.78]
["Nitrogen Dioxide","10102-44-0",46,1,15,30,21.1,null,null,null,null,null,3,0,3,null,null,null,null,null,null,null,null,1.6655000000000002,4.0750000000000005E-3,0.19750000000000001,3.7749999999999993E-3,176.2,0.245,0,14.103875053593896,4148.2747425445787,0]
["Nitromethane","75-52-5",61.04,38,38,1000,101.2,-28.6,35,7.3,63,418,1,3,4,null,"Normal",null,"Medium",null,null,null,"Conductive",1.17,1.5709999999999999E-3,0.40200000000000002,6.3400000000000001E-4,154.4,0.1741,3.6999999999999999E-4,10.193,3366.33,44.08]
["Nitropropane, 1-","108-03-2",89.1,74,385,2300,131.19999999999999,-104.2,36,2.2000000000000002,null,null,2,3,2,null,"Normal",null,"Medium","Harmful",null,null,"Conductive",1.02,1.196E-3,0.41499999999999998,8.25E-4,121.8,0.14871999999999999,2.24E-4,10.0045,3545.06,50.28]
["Nitropropane, 2-","79-46-9",89.1,27,385,2300,120.3,-91.2,24,2.6,null,null,1,3,1,null,"Normal",null,"Medium",null,null,null,null,1.008,1.2229999999999999E-3,0.38900000000000001,8.4400000000000002E-4,115.1,0.13785,2.2699999999999999E-4,9.8516999999999992,3392.38,49.25]
["Octadecanol, 1-","112-92-5",270.5,null,2,360,350.8,57.9,176,0.4,null,null,0,0,0,null,"Normal",null,"Medium",null,null,null,null,0.86,7.5799999999999999E-4,0.63600000000000001,3.8499999999999998E-4,105.1,0.13850000000000001,7.4999999999999993E-5,10.4154,5135.49,130.75]
["Octane","111-65-9",114.23,235,385,5000,125.6,-56.8,13,0.95,null,null,2,3,0,null,"Normal",null,"Medium","Harmful","Very Toxic",null,null,0.71599999999999997,8.9099999999999997E-4,0.51800000000000002,9.7269999999999995E-4,91.2,0.14834700000000001,8.2600000000000002E-5,9.5432000000000006,3276.02,55.91]
["Pentane","78-78-4",72.150000000000006,3000,32500,190000,36,-129.80000000000001,-48.15,1.4,null,null,2,4,0,null,null,null,null,null,null,null,null,0.63800000000000001,9.9500000000000001E-4,0.52300000000000002,1.2842000000000001E-3,92,0.18113599999999999,3.3799999999999998E-4,9.3117999999999999,2541.5700000000002,36.270000000000003]
["Pentanedione, 2, 4-","123-54-6",100.12,25,25,39,141.30000000000001,-23,34,null,null,null,2,3,1,null,null,null,null,"Harmful",null,null,"Conductive",0.99099999999999999,1.0460000000000001E-3,0.38,6.692E-4,98.7,9.2071E-2,1.7200000000000001E-4,9.1478000000000002,3281.49,55.84]
["Pentenenitrile, 2-","13284-42-9",81.12,2,15,75,125,null,8,null,null,null,3,3,1,null,"Normal",null,"Medium",null,null,null,null,0.83799999999999997,8.5999999999999998E-4,0.442,1.08E-3,138.30000000000001,0.17399999999999999,0,13.045999999999999,5192.3999999999996,0]
["Phenol","108-95-2",94.11,10,50,200,181.9,40.9,79,1.8,null,null,4,2,0,null,"Normal",null,"Medium","Toxic",null,null,"Conductive",1.103,1.01E-3,0.499,4.2099999999999999E-4,157.19999999999999,0.21920000000000001,3.3300000000000003E-5,9.9510000000000005,3616.65,91.67]
["Phenyl Isocyanate","103-71-9",119.1,null,1.4999999999999999E-2,0.15,166.3,-30,51,1.5,null,null,3,2,1,null,"Normal",null,"Medium",null,null,null,null,1.117,1.1169999999999999E-3,0.315,7.0600000000000003E-4,95,7.8950000000000006E-2,1.12E-4,9.9574999999999996,3876.08,50.29]
["Phosgene","75-44-5",98.9,null,0.5,1.5,7.5,null,null,null,null,null,4,0,1,null,null,null,null,null,null,null,"Conductive",1.421,2.4499999999999999E-3,0.245,2.0000000000000002E-5,59.8,0.13100000000000001,0,10.675000000000001,2994.3,0]
["Phosophorous Oxychloride","10025-87-3",153.30000000000001,null,0.2,0.85,106,null,null,null,null,null,3,0,3,null,null,null,null,"Corrosive",null,null,"Conductive",1.698,2.1299999999999999E-3,0.189,1.0000000000000001E-5,48.1,5.8000000000000003E-2,0,11.446999999999999,4335,0]
["Phosophorous Trichloride","7719-12-2",137.30000000000001,0.5,3,15,76.099999999999994,-92,null,null,null,null,3,0,2,null,null,null,null,"Corrosive",null,null,null,1.6140000000000001,2.1480000000000002E-3,0.20100000000000001,3.4E-5,58.2,8.1799999999999998E-2,1.5200000000000001E-4,9.4896999999999991,2959.23,37.479999999999997]
["Phosphine","7803-51-2",34,null,0.5,5,-87.5,null,-115,16.7,null,null,4,4,2,null,"High",null,"Medium",null,"Very Toxic",null,null,0.60199999999999998,1.83E-3,0.54800000000000004,1.3699999999999999E-3,72.7,0.499,1.66E-3,8.8353999999999999,1447.13,21.88]
["Piperazine","110-85-0",86.1,0.28000000000000003,3.12,53.9,148.6,110.3,87.8,1.9,null,null,3,1,1,null,"Normal",null,"Medium",null,null,null,null,1.0129999999999999,1.08E-3,0.52800000000000002,8.4000000000000003E-4,141.80000000000001,0.1905,8.5000000000000006E-5,11.090400000000001,4372.62,28.48]
["Polyethylene Glycol","25322-68-3",310.39999999999998,2.36,15.8,1418,369.3,null,null,null,null,null,0,1,0,null,"Normal",null,"Medium",null,null,null,null,1.105,5.5599999999999996E-4,0.40300000000000002,7.3999999999999999E-4,90.9,6.2350000000000003E-2,7.0500000000000006E-5,14.4269,8795.24,32.24]
["Propane","74-98-6",44.09,5500,null,null,-42,null,-104,2.1,null,null,2,4,0,null,"Normal",null,"Medium",null,null,null,null,0.52900000000000003,1.5399999999999999E-3,0.59299999999999997,2.49E-3,89.7,0.40100000000000002,0,9.952,2298.8000000000002,0]
["Propanol, 1-","71-23-8",60.07,250,250,4000,97.2,-126,17.850000000000001,2,null,null,1,3,0,null,"Normal",null,"Medium",null,null,null,"Conductive",0.81799999999999995,9.1E-4,0.56000000000000005,2.3506999999999998E-3,195.5,0.26812399999999997,4.4900000000000002E-4,13.0519,4372.62,36.74]
["Propionaldehyde","123-38-6",58.08,45,260,840,47.9,-101.6,-30,2.9,null,null,3,3,2,null,null,null,null,null,null,null,"Conductive",0.81399999999999995,1.2199999999999999E-3,0.53700000000000003,4.8000000000000001E-4,130.5,0.24640000000000001,1.6000000000000001E-4,9.7241999999999997,2707.95,42.55]
["Propionic Acid","79-09-4",74.08,15,15,170,141,-20.5,51.85,2.9,null,null,3,2,0,null,null,null,null,null,null,null,"Semi-Conductive",1.008,1.108E-3,0.48,1.0330000000000001E-3,95.1,-0.23621500000000001,1.274E-3,11.641299999999999,4384.34,38.75]
["Propyl Acetate, n-","109-60-4",102.13,240,1300,7900,101.5,-92.5,14,1.8,null,null,1,3,0,null,"Normal",null,"Medium",null,null,null,"Semi-Conductive",0.90600000000000003,1.2049999999999999E-3,0.44900000000000001,9.3179999999999999E-4,97.2,0.15454499999999999,2.3599999999999999E-4,10.0108,3241.85,51.56]
["Propylene","115-07-1",42.1,1500,2800,17000,-47.7,-185.3,-108.2,2,11,455,1,4,1,null,"Normal",null,"Medium",null,null,null,null,0.55200000000000005,1.1999999999999999E-3,0.53900000000000003,3.3750000000000002E-4,92,0.27500000000000002,1.8699999999999999E-4,8.6661999999999999,1680.06,31.54]
["Propylene Glycol","57-55-6",76.099999999999994,9.6,418,2500,187.6,-31,99,2.6,null,null,0,1,0,null,"Normal",null,"Medium",null,null,null,null,1.0529999999999999,8.2799999999999996E-4,0.55400000000000005,1.127E-3,216,0.19700000000000001,2.5999999999999998E-4,13.948499999999999,6152.6,19.75]
["Propylene Oxide","75-56-9",58.08,50,250,750,34.200000000000003,-111.9,-37,1.6,41.6,449,3,4,2,null,"Elevated",null,"High",null,null,null,null,0.84299999999999997,1.25E-3,0.498,7.1000000000000002E-4,120.8,0.2344,2.4000000000000001E-4,9.6994000000000007,2596.98,39.56]
["Pyridine","110-86-1",79.099999999999994,3,19,3700,115.2,-41.7,20,1.8,12,482,3,3,0,null,"Normal",null,"Medium",null,null,null,"Conductive",1.004,1.1429999999999999E-3,0.371,8.6399999999999997E-4,125.1,0.14069999999999999,2.3800000000000001E-4,9.7913999999999994,3307.98,50.6]
["Styrene","100-42-5",104.15,50,250,1000,145.19999999999999,-30.6,31,0.88,null,null,2,3,2,null,"Normal",null,"Medium",null,null,null,"Non-Conductive",0.92400000000000004,8.9999999999999998E-4,0.40100000000000002,7.3999999999999999E-4,104.4,0.13900000000000001,0,12.055,5036.3,0]
["Sulfolane","126-33-0",120.17,0.2,2.44,2.44,285.89999999999998,30.5,177,1.9,null,null,1,1,0,null,null,null,null,null,null,null,null,1.296,9.3800000000000003E-4,0.29099999999999998,6.0800000000000003E-4,130.69999999999999,6.615E-2,8.9499999999999994E-5,10.620900000000001,5307.5,59.29]
["Sulfur Dioxide","7446-09-5",64.06,0.3,3,25,-10,-103.4,null,null,null,null,3,0,0,null,null,null,null,null,null,null,null,1.4019999999999999,2.64E-3,0.33300000000000002,2.4399999999999999E-4,91.1,0.22770000000000001,4.7600000000000002E-4,10.2555,2351.06,33.92]
["Sulfuric Acid","7664-93-9",98.1,0.5,2.4900000000000002,29.9,336.9,10.3,null,null,null,null,3,0,2,null,null,null,null,"Corrosive",null,null,"Conductive",1.857,1.057E-3,0.33600000000000002,2.418E-4,213,0.14799999999999999,5.1E-5,15.416,9100,0]
["Sulfuryl Chloride","7791-25-5",134.97,0.3,3,15,72.7,-46.2,null,null,null,null,3,0,2,null,null,null,null,null,null,null,null,1.7145999999999999,2.3630000000000001E-3,0.20580000000000001,1.8230000000000001E-4,57.8,0.10589999999999999,0,10.398899999999999,3607.23,0]
["Sulfuryl Fluoride","2699-79-8",102.06,null,21,64,-55,-214.1,null,null,null,null,3,0,1,null,null,null,null,null,"Very Toxic",null,null,1.4590000000000001,6.13E-3,0.27100000000000002,1.8799999999999999E-3,36.299999999999997,0.23300000000000001,0,10.542999999999999,2295.1999999999998,0]
["t-Butyl Catechol","98-29-3",166.22,null,0.28999999999999998,82.4,289.7,52.8,130,null,null,null,3,1,0,null,null,null,null,"Toxic",null,null,null,1.1080000000000001,9.3800000000000003E-4,0.433,8.5899999999999995E-4,122.2,0.10829999999999999,1.34E-4,11.108000000000001,5243.62,90.7]
["Tetrachloroethane, 1,1,1,2-","630-20-6",167.85,1,6,13,130.19999999999999,-68.7,null,null,null,null,3,0,0,null,"Normal",null,"Medium",null,null,null,null,1.5708,1.4940000000000001E-3,0.20569999999999999,2.7310000000000002E-4,60.62,7.6630000000000004E-2,0,11.73287,4746.1319999999996,0]
["Tetrachloroethylene (Perchloroethylene)","127-18-4",165.85,100,200,1000,121,-22.4,null,null,null,null,2,0,0,null,null,null,null,null,"Toxic",null,null,1.6639999999999999,1.902E-3,0.20599999999999999,1.7000000000000001E-4,59.6,6.4500000000000002E-2,1.1900000000000001E-4,9.3628,3161.06,56.57]
["Tetraethylene Glycol","112-60-7",194.2,10.95,120.9,718,326.39999999999998,-9.4,174,null,null,null,0,1,0,null,"Normal",null,"Medium",null,null,null,null,1.141,7.9600000000000005E-4,0.39800000000000002,7.9500000000000003E-4,106.9,8.8700000000000001E-2,0,14.635999999999999,8772.7000000000007,0]
["Tetrafluoroethylene","116-14-3",100.02,200,1000,10000,-75.599999999999994,-142.5,null,10,null,null,null,null,null,null,null,null,null,null,null,null,null,1.216,3.7499999999999999E-3,0.311,5.2499999999999997E-4,27,0.2,3.6099999999999999E-4,9.2891999999999992,1596.3,25.71]
["Tetrahydrofuran","109-99-9",72.099999999999994,100,500,5000,66,-65,-14,2,null,null,2,3,1,null,"Normal",null,"Medium",null,null,null,null,0.90100000000000002,1.1050000000000001E-3,0.38700000000000001,1.0019E-3,110.2,0.15723500000000001,2.7700000000000001E-4,9.4550000000000001,2763.61,46.83]
["Tetralin","119-64-2",132.21,null,4.2999999999999997E-2,12,207.4,-35.799999999999997,71,0.84,null,null,2,2,1,null,null,null,null,null,"Toxic",null,null,0.99199999999999999,9.2400000000000002E-4,0.34200000000000003,9.8620000000000001E-4,98.5,7.2181999999999996E-2,1.47E-4,9.6944999999999997,4044.13,63.71]
["Thionyl Chloride","7719-09-7",119,0.2,2,10,76,null,null,null,null,null,4,0,2,null,null,null,null,null,null,null,null,1.6719999999999999,1.7600000000000001E-3,0.223,4.0999999999999999E-4,68.5,0.108,0,11.218,3912.7,0]
["Titanium Tetrachloride","7550-45-0",189.69,0.64,2.58,12.89,136.19999999999999,-25,null,null,null,null,4,0,2,null,null,null,null,null,null,null,null,1.752,1.8079999999999999E-3,0.24399999999999999,-2.9599999999999998E-4,55.2,9.0709999999999999E-2,-5.9200000000000002E-5,9.5724,3418.37,52.15]
["Toluene","108-88-3",92.14,50,300,1000,110.6,-95,4,1.1000000000000001,7.1,480,2,3,0,null,"Normal",null,"Medium",null,null,null,"Non-Conductive",0.89100000000000001,1.059E-3,0.35099999999999998,9.2800000000000001E-4,98,9.4E-2,2.2000000000000001E-4,9.4437999999999995,3136.86,51.66]
["Trichloroethylene","79-01-6",131.38999999999999,100,500,5000,87.3,-86.5,null,8,null,null,2,0,1,null,null,null,null,null,"Harmful",null,"Semi-Conductive",0.14899999999999999,1.8699999999999999E-4,0.217,2.652E-4,64.8,7.8146999999999994E-2,1.44E-4,9.8757000000000001,3163.58,43.4]
["Triethanolamine","102-71-6",149.19,2.46,8.36,180.2,336,21.6,179,1.2,null,null,2,1,0,null,"Normal",null,"Medium",null,null,null,null,1.161,7.4799999999999997E-4,0.49099999999999999,7.8720000000000005E-4,168.4,0.115188,1.47E-4,12.8216,6654.53,90.89]
["Triethylamine","121-44-8",101.19,3,3,1000,89,-114.8,-12,1.2,null,null,3,3,0,null,"Normal",null,"Medium",null,null,null,"Non-Conductive",0.746,9.1E-4,0.46899999999999997,1.1900000000000001E-3,85.1,0.123,0,11.406000000000001,4122,0]
["Triethylbenzene","877-44-1",162.28,4.7,51,450,218.4,null,83,1,5.6,null,0,2,0,null,null,null,null,null,null,null,null,0.89,7.7999999999999999E-4,0.39600000000000002,1.0200000000000001E-3,90.3,8.1000000000000003E-2,1E-4,10.638999999999999,4781.9399999999996,42.29]
["Triethylenetetramine","112-24-3",146.24,3,5.7,83,276,-35.15,135,null,null,null,3,1,0,null,null,null,null,"Harmful","Harmful",null,"Conductive",0.998,9.2800000000000001E-4,0.46800000000000003,8.5970000000000003E-4,129.6,0.12919600000000001,7.5900000000000002E-5,10.948700000000001,5168.3999999999996,77.98]
["Tri-isopropanol amine","122-20-3",191.3,0.38,3.8,19.2,309.3,57.4,160,1.4,null,null,2,0,0,null,"Normal",null,"Medium",null,null,null,null,1.0640000000000001,1.0269999999999999E-3,0.39200000000000002,1.0499999999999999E-3,112.9,7.1499999999999994E-2,1.45E-4,12.2569,6165.1,78.760000000000005]
["Trimethylamine","75-50-3",59.1,0.1,100,500,2.7,-117,-71,2,null,null,3,4,0,null,"Normal",null,"Medium",null,null,null,"Conductive",0.65600000000000003,1.25E-3,0.52700000000000002,1.0399999999999999E-3,93.8,0.21879999999999999,4.06E-4,8.9728999999999992,2102.5300000000002,41.42]
["Tripropylene Glycol","24800-44-0",192.3,1.1000000000000001,13,76,265.10000000000002,null,141,null,null,null,1,1,0,null,"Normal",null,"Medium",null,null,null,null,1.0780000000000001,1.1479999999999999E-3,0.442,9.6500000000000004E-4,111.3,6.3600000000000004E-2,2.6499999999999999E-4,13.1913,6420.49,51.58]
["Valealdehyde, n-","110-62-3",86.13,2.0000000000000001E-4,150,750,102.7,-91.5,12,1.8,null,null,2,3,0,null,"Normal",null,"Medium",null,null,null,null,0.82499999999999996,1.0269999999999999E-3,0.52200000000000002,5.3640000000000003E-4,111.3,0.17429800000000001,5.7899999999999998E-5,9.7220999999999993,3157.65,51.08]
["Vinyl Acetate","108-05-4",86.1,5,75,500,72.8,-93.2,-8,2.6,null,null,2,3,0,null,"Normal",null,"Medium",null,null,null,"Conductive",0.96199999999999997,1.531E-3,0.46700000000000003,3.2600000000000001E-4,101.9,0.19363,1.37E-4,9.9389000000000003,2965.22,47.73]
["Vinyl Chloride","75-01-4",62.5,500,5000,20000,-13.8,-153.69999999999999,-77.2,3.6,null,null,2,4,2,null,"Normal",null,"Medium",null,null,null,null,0.93700000000000006,1.7049999999999999E-3,0.36299999999999999,5.0940000000000002E-4,81.8,0.21029999999999999,3.6299999999999999E-4,9.3853000000000009,2146.73,30.6]
["Vinyl Cyclohexene","100-40-3",108.2,0.3,38,310,127.9,-109.5,15.85,1,null,null,2,3,0,null,null,null,null,null,null,null,null,0.84699999999999998,9.9200000000000004E-4,0.40300000000000002,1.0399999999999999E-3,90.8,9.1728000000000004E-2,1.8900000000000001E-4,9.3263999999999996,3244.01,52.98]
["Vinyl Toluene (m)","25013-15-4",118.2,0.4,100,500,172.2,-86.3,49,0.8,7.2,null,2,2,2,null,"Normal",null,"Medium",null,null,null,null,0.92800000000000005,9.5399999999999999E-4,0.37,8.8699999999999998E-4,101,8.6660000000000001E-2,1.6200000000000001E-4,9.3272999999999993,3475.74,72.3]
["Vinylbenzyl Chloride","30030-25-2",152.6,null,0.5,3,229.1,-10.9,104,2,null,null,3,1,1,null,"Normal",null,"Medium","Corrosive",null,null,null,1.194,1.1199999999999999E-3,0.35399999999999998,4.5199999999999998E-4,96.3,0.1134,2.3E-5,10.6875,4838.3500000000004,49.74]
["Vinylidene Chloride","75-35-4",96.97,null,500,1000,32,null,-28,6.6,null,null,2,4,2,null,"Normal",null,"Medium",null,null,null,"Conductive",1.252,1.97E-3,0.26900000000000002,3.2499999999999999E-4,68.5,0.124,0,10.801,3291,0]
["Water","7732-18-5",18.02,null,null,null,100,0,null,null,null,null,0,0,0,null,null,null,null,null,null,null,"Conductive",1.0169999999999999,7.7999999999999999E-4,0.98299999999999998,5.6700000000000001E-4,596.29999999999995,0.45500000000000002,1.0349999999999999E-3,11.712400000000001,3853.28,44.13]
["Xylene, m-","108-38-3",106.17,130,920,2500,139.1,-47.9,29,1.1000000000000001,null,null,2,3,0,null,null,null,null,"Harmful",null,null,"Non-Conductive",0.88200000000000001,9.7599999999999998E-4,0.37,9.6400000000000001E-4,98.6,0.1,1.92E-4,9.6419999999999995,3453.31,54.28]

{"sheet":"Revision History","index":12,"n_rows":28,"n_cols":4,"rows_kept":28,"cut":false,"hidden":true,"merged":[[1,1,1,3],[3,2,3,3],[4,2,4,3]]}
[]
[null,"Change History"]
[]
[null,"Title:","CHEF Calculation Aid"]
[null,"Document Owner:","CCPS"]
[]
[]
[null,"Version","Change","Date"]
[null,"Workbook V1.0","Initial issue.  Originally donated documentation with minor modifications.  Updated Correlation Coefficient for Baker-Strehlow-Tank to match correlations used in RAST","2018-02-05"]
[null,"Workbook V1.1","Corrected coefficient for aerosol evaporation.  Updated Vapor Cloud Explosion to reference Lower Flammable Limit (LFL) rather than ½ LFL and updated cloud volume correlation.  Corrected indoor population density under Impact Assessment.  Added Offsite Toxic section to the Impact Assessment worksheet.","2018-09-14"]
[null,"Workbook V2.0","Updated Vapor Cloud Volume as quantity in cloud divided by an average concentration.  Averaging Time correction for flammable releases added to Vapor Dispersion.  Updated input label on Impact Assessment to \"Offsite\" population density.  Added list of example scenarios.  Updated equation numbers of match CHEF Manual version 2.0.  Updated vessel burst energy to reflect flashing liquid.  Added example LOPA worksheet.","2019-02-24"]
[null,"Workbook V3.0","Updated Vapor Dispersion correlation to directly utilize Britter-McQuaid Dense Gas model and account for non-isothermal release.  Updated equation numbers to match CHEF Manual version 3.0.","2020-03-09"]
[null,"Workbook V3.1","Corrected surface roughness correction estimate for dense gas dispersion for alternative weather conditions.","2020-04-02"]
[null,"Workbook V3.2","Corrected toxic infiltration to utilize User input for Multiple of ERPG-3 at LC01 and LC50.  Corrected coefficient for Explosion Building Vulerability.  Corrected Offsite Toxic Integration Coefficient.  Corrected for Altnerate Weather jet mixing.","2020-10-20"]
[null,"Workbook V3.2","Corrected surface roughness correction estimate for dense gas dispersion and neutrally buoyant puffs.  Updated cloud footprint to 0.3 X2 to better account for dense gas.  Added fragment range to explosion impact area.","2020-11-28"]
[null,"Workbook V4.0","Added New Worksheets for Chemical Hazards, Reactiviy Hazards, and Frequency Evaluation.  Correction Averaging Time factor for Vapor Dispersions to be only applicable to gaussian neutrally bouyant region.  Updated all equation numbers to match current CHEF Manual.","2021-03-23"]
[null,"Workbook V4.1","Updated some notes and formats on various worksheets.  Added Short Pipe L/D<3 on Source Model.  Updated TNT Equivalency Graph.  Added Indoor Concentration vs Time graph to Vapor Dispersion worksheet.  Added offsite explosion impact estimate.  Added aerosol and pool temperature trial-and-error estimates.","2022-02-18"]
[null,"Workbook V4.2","Corrected error in Effective Release Elevation in Equation 12-16 and added Pool Fire Radiation distance estimate to Impact worksheet based on equation 14-10.","2022-09-22"]
[null,"Workbook V4.2","Correcting spelling errors throughout workbook,","2022-10-17"]
[null,"Workbook V4.2","Vapor Dispersion worksheet - Removed limit on indoor concentration at Steady State","2022-12-21"]
[null,"Workbook V4.3","Source Model worksheet - Corrected coefficients for liquid hole sizen and flashing liquid hole size.  Impact Assessment worksheet - added Building Vulnerability category for \"Structural Frame\" construction type.","2023-01-20"]
[null,"Workbook V4.3","Added Dimethyl Disulfide to the Chemical Table","2023-03-29"]
[null,"Workbook V4.3","Corrected cell link in Chemical Hazards worksheet for flammability.  Correct ERPG values for Ethylene Glycol.  Corrected conversion factors for Explosion worksheet.","2023-07-20"]
[null,"Workbook V4.3","Moved wind speed and surface roughness inputs for Vapor Dispersion to input section of worksheet.  Corrected conditional format for inputs on Explosion worksheet.","2024-01-26"]
[null,"Workbook V4.3","Corrected input units for Distance to 1 psi overpressure on Impact Assessment.  Added note to offsite toxic impact on Impact Assessment worksheet.","2024-06-06"]
[null,"Workbook V4.3","Updated CHEF Guide equation numbers on Vapor Dispersion worksheet.","2024-12-23"]
[null,"Workbook V4.4","Updated Impact Assessment worksheet to show toxic infiltration concentration versus time plot and average indoor concentration.  Updated text description for explosion building type.","2025-03-24"]
[null,"Workbook V4.5","Updated Explosions worksheet to utilize estimated cloud flammable mass times heat of combustion for Vapor Cloud Explosion.  Updated equation numbers.","2025-12-28"]